{"text_format":"1","workbook":"xlsx","n_sheets":9,"sheets":["Forside","Kvartal","Årlig","Fordeling av post 15","nfl_01","nfl_02","nfl_03","nfl_04","global"],"not_rendered":{"charts":0,"images":1,"macros":1,"external_links":1,"defined_names":4,"comments":0,"pivot_tables":0},"unopened":[],"bounds":{"document_bytes":16777216,"sheet_cells":100000,"rows_first":2000,"rows_last":500,"rows_between":2000,"halvings":0,"cell_chars":16384,"cell_head_chars":4096},"cells_cut":0,"cells_raw":0,"read":"whole","date_system":"1900"}

{"sheet":"Forside","index":0,"n_rows":13,"n_cols":98,"rows_kept":13,"cut":false,"hidden":false,"merged":[[12,4,12,5],[12,1,12,2],[11,1,11,2],[11,3,11,4],[6,1,6,7],[7,2,7,6],[8,1,8,5],[9,1,9,5],[10,1,10,2],[10,3,10,4]]}
["Versjonsnummer",null,"KRT-1133",null,null,null,null,null,null,null,null,null,null,null,null,null,null,null,null,{"$f":"YEAR(NOW())-1","v":2024},1,{"$f":"DATE(T1,U2+1,0)","v":"2024-02-29"},null,null,1,null,{"$f":"D12","v":"31.03.2025"},"pr.",null,null,null,null,null,null,null,null,null,null,null,null,null,null,null,null,null,null,null,null,null,null,null,null,{"$f":"C1","v":"KRT-1133"},{"$f":"B12","v":20230331},{"$f":"A2","v":293},{"$f":"G10","v":0},{"$f":"F12","v":2025},{"$f":"IF(G12=\"1.kvartal\",CONCATENATE(\"3\"),IF(G12=\"1.halvår\",CONCATENATE(\"6\"),IF(G12=\"1.-3.kvartal\",CONCATENATE(\"9\"),IF(G12=\"År\",CONCATENATE(\"12\"),\"\"))))","v":"3"},10,"Forside",{"$f":"IF(G13=\"Konsolidert\",2,IF(G13=\"Ikke Konsolidert\",1,IF(G13=\"\",-1)))","v":-1},0,null,null,null,null,null,null,null,null,null,null,null,null,null,null,null,null,"BA",999999001,"BB",{"$f":"+CB1+1","v":999999002},"BC",{"$f":"+CD1+1","v":999999003},"BD",{"$f":"+CF1+1","v":999999004},"BE",{"$f":"+CH1+1","v":999999005},"BF",{"$f":"+CJ1+1","v":999999006},"BG",{"$f":"+CL1+1","v":999999007},"BH",{"$f":"+CN1+1","v":999999008},"BI",{"$f":"+CP1+1","v":999999009},"BJ",{"$f":"+CR1+1","v":999999010}]
[293,null,null,null,null,null,null,null,null,null,null,null,null,null,null,null,null,null,null,{"$f":"YEAR(NOW())","v":2025},2,{"$f":"DAY(V1)","v":29},null,null,2,null,{"$f":"CONCATENATE(LEFT(AA1,6),CONCATENATE(RIGHT(T1,4)))","v":"31.03.2024"},null,null,null,null,null,null,null,null,null,null,null,null,null,null,null,null,null,null,null,null,null,null,null,null,null,"Skjema-ID","Gyldig Excel Mal","VersjonsNr","Orgnr","År","MND","Antall datakolonner","Arknavn","Kons./ikke kons.","SA/IRB"]
[null,null,null,null,null,null,null,null,null,null,null,null,null,null,null,null,null,null,null,null,3,null,null,null,3,null,"brukes i arkfane nfl_01",null,null,null,null,null,null,null,null,null,null,null,null,null,null,null,null,null,null,null,null,null,null,null,null,null,null,null,null,null,null,null,"i dokumentet"]
[null,null,null,null,null,null,null,null,null,null,null,null,null,null,null,null,null,null,null,null,4,null,null,null,4]
[null,null,null,null,null,null,null,null,null,null,null,null,null,null,null,null,null,null,null,null,5,null,null,null,5]
[null,null,null,null,null,null,null,null,null,null,null,null,null,null,null,null,null,null,null,null,6,null,null,null,6]
[null,"Skjema for rapportering av forbrukslån  (Lån uten sikkerhet til personkunder) ",null,null,null,null,null,null,null,null,null,null,null,null,null,null,null,null,null,null,7,null,null,null,7]
[null,null,null,null,null,null,null,null,null,null,null,null,null,null,null,null,null,null,null,null,8,null,null,null,8]
[null,"FORETAKETS NAVN:",null,null,null,null,"ORGANISASJONS-\nNUMMER:",null,null,null,null,null,null,null,null,null,null,null,null,null,9,null,null,null,9]
[null,null,null,null,null,null,null,null,null,null,null,null,null,null,null,null,null,null,null,null,10,null,null,null,10]
[null,"EXCELMAL GYLDIG FRA:",null,"SISTE DAG I \nRAPPORTERINGSPERIODEN:",null,"RAPPORTERINGSÅR:","RAPPORTERINGSPERIODE:",null,null,null,null,null,null,null,null,null,null,null,null,null,11]
[null,20230331,null,{"$f":"IF(G12=\"1.kvartal\",CONCATENATE(\"31.03.\",CONCATENATE(RIGHT(F12,4))),IF(G12=\"1.halvår\",CONCATENATE(\"30.06.\",CONCATENATE(RIGHT(F12,4))),IF(G12=\"1.-3.kvartal\",CONCATENATE(\"30.09.\",CONCATENATE(RIGHT(F12,4))),IF(G12=\"År\",CONCATENATE(\"31.12.\",CONCATENATE(RIGHT(F12,4)))))))","v":"31.03.2025"},null,2025,"1.kvartal",null,null,null,null,null,null,null,null,null,null,null,null,null,12]
[null,null,null,null,null,null,null,{"$f":"IF(G13=\"Ja\",1,\"\")","v":""}]

{"sheet":"Kvartal","index":1,"n_rows":59,"n_cols":8,"rows_kept":59,"cut":false,"hidden":false,"merged":[[0,2,2,4]]}
[null,null,"Skjema for rapportering av forbrukslån  (Lån uten sikkerhet til personkunder) "]
[]
[]
[]
[null,null,{"$f":"Forside!B10","v":0}]
[null,null,"Del 1: Regnskapstall forbrukslån",{"$f":"Forside!$G$12 &\" \" &Forside!F12","v":"1.kvartal 2025"},{"$f":"Forside!$G$12 &\" \" &Forside!F12-1","v":"1.kvartal 2024"}]
[null,null,null,"mill. kr","mill. kr"]
["ccr_1","1.","Renteinntekter"]
["ccr_2","2.","Rentekostnader",null,null,null,null,{"$f":"IF(D9<0,\"Post 2 skal føres med positivt fortegn\",IF(E9<0,\"Post 2 skal føres med positivt fortegn\",\"\"))","v":""}]
["ccr_3","3.","Netto renteinntekter (1 - 2)",null,null,null,null,{"$f":"IF(ISBLANK(D10),\"Post 3 må fylles ut\",IF(ISBLANK(E10),\"Post 3 må fylles ut\",\"\"))","v":"Post 3 må fylles ut"}]
["ccr_4","4.","Tap på utlån (4.1 + 4.2)"]
["ccr_5","4.1","Tap kredittkort"]
["ccr_6","4.2","Tap andre forbrukslån"]
["ccr_7",5,"Resultat av ordinær drift før skatt",null,null,null,null,{"$f":"IF(ISBLANK(D14),\"Post 5 må fylles ut\",IF(ISBLANK(E14),\"Post 5 må fylles ut\",\"\"))","v":"Post 5 må fylles ut"}]
[]
["ccr_8","6.","Gjennomsnittlig forvaltningskapital",null,null,null,null,{"$f":"IF(ISBLANK(D16),\"Post 6 må fylles ut\",IF(ISBLANK(E16),\"Post 6 må fylles ut\",\"\"))","v":"Post 6 må fylles ut"}]
[null,null,null,{"$f":"Forside!D12","v":"31.03.2025"},{"$f":"CONCATENATE(LEFT(D17,6),CONCATENATE(RIGHT(E6,4)))","v":"31.03.2024"}]
[null,null,null,"mill. kr","mill. kr"]
["ccr_9","7.","Brutto utlån kunder (7.2 + 7.6) ",null,null,{"$f":"D21+D25","v":0},{"$f":"E21+E25","v":0},{"$f":"IF(OR(ROUND(D19,0)<>ROUND(F19,0),ROUND(E19,0)<>ROUND(G19,0)),\"Må fylles ut! Er lik 7.2+7.6\",\"\")","v":""}]
["ccr_10","7.1","    Herav Norge (7.3 + 7.7)",null,null,{"$f":"D22+D26","v":0},{"$f":"E22+E26","v":0},{"$f":"IF(OR(ROUND(D20,0)<>ROUND(F20,0),ROUND(E20,0)<>ROUND(G20,0)),\"Brutto utlån kunder avviker fra summen av postene 7.3+7.7\",\"\")","v":""}]
["ccr_11","7.2","Kredittkort",null,null,null,null,{"$f":"IF(AND(D21<>0,D22=\"\"),\"Må fylle ut post 7.3\",IF(AND(E21<>0,E22=\"\"),\"Må fylle ut post 7.3\",\"\"))","v":""}]
["ccr_12","7.3","    Herav Norge",null,null,null,null,{"$f":"IF(AND(D22<>0,D21=\"\"),\"Må fylles ut post 7.2\",IF(AND(E22<>0,E21=\"\"),\"Må fylles ut post 7.2\",\"\"))","v":""}]
["ccr_13","7.4","Rentebærende volum kredittkort (av 7.2 ) "]
["ccr_68","7.5","Rentebærende volum kredittkort Norge (av 7.3)"]
["ccr_14","7.6","Andre forbrukslån",null,null,null,null,{"$f":"IF(AND(D25<>0,D26=\"\"),\"Må fylles ut post 7.7\",IF(AND(E25<>0,E26=\"\"),\"Må fylles ut post 7.7\",\"\"))","v":""}]
["ccr_15","7.7","    Herav Norge",null,null,null,null,{"$f":"IF(AND(D26<>0,D25=\"\"),\"Må fylles ut post 7.6\",IF(AND(E26<>0,E25=\"\"),\"Må fylles ut post 7.6\",\"\"))","v":""}]
[]
["ccr_16","8. ","Brutto misligholdte engasjementer, 90 dager 1) (8.2 + 8.4)",null,null,{"$f":"D30+D32","v":0},{"$f":"E30+E32","v":0},{"$f":"IF(OR(ROUND(D28,0)<>ROUND(F28,0),ROUND(E28,0)<>ROUND(G28,0)),\"Må fylles ut! Er lik 8.2+8.4\",IF(AND(D28<>0,D29=\"\"),\"Må fylles ut post 8.1\",\"\"))","v":""}]
["ccr_17","8.1","    Herav Norge (8.3 + 8.5)",null,null,{"$f":"D31+D33","v":0},{"$f":"E31+E33","v":0},{"$f":"IF(OR(ROUND(D29,0)<>ROUND(F29,0),ROUND(E29,0)<>ROUND(G29,0)),\"Må fylles ut! Er lik 8.3+8.5\",IF(AND(D29<>0,D28=\"\"),\"Må fylles ut post 8\",\"\"))","v":""}]
["ccr_18","8.2","Mislighold kredittkort, 90 dager",null,null,null,null,{"$f":"IF(AND(D30<>0,D31=\"\"),\"Må fylles ut 8.3\",\"\")","v":""}]
["ccr_19","8.3","    Herav Norge ",null,null,null,null,{"$f":"IF(AND(D31<>0,D30=\"\"),\"Må fylles ut post 8.2\",\"\")","v":""}]
["ccr_20","8.4","Mislighold andre forbrukslån, 90 dager ",null,null,null,null,{"$f":"IF(AND(D32<>0,D33=\"\"),\"Må fylles ut post 8.5\",\"\")","v":""}]
["ccr_21","8.5","    Herav Norge ",null,null,null,null,{"$f":"IF(AND(D33<>0,D32=\"\"),\"Må fylles ut post 8.4\",\"\")","v":""}]
[]
["ccr_22","9.","Betalingslettelse med nedskrivning "]
["ccr_23","10.","Betalingslettelse uten nedskrivning"]
[]
["ccr_24","11.","Tapsnedskrivninger steg 1",null,null,null,null,{"$f":"IF(D38>0,\"Skal være negativ\",IF(E38>0,\"Skal være negativ\",\"\"))","v":""}]
["ccr_25","12.","Tapsnedskrivninger steg 2/Gruppenedskrivninger",null,null,null,null,{"$f":"IF(D39>0,\"Skal være negativ\",IF(E39>0,\"Skal være negativ\",\"\"))","v":""}]
["ccr_26","13.","Tapsnedskrivninger steg 3/Individuelle nedskrivninger ",null,null,null,null,""]
[null,null,"1) Jf. veiledningen til ORBOF-rapport 12, kapittel 17, og kapitalkravsforskriften §10-1"]
[]
[null,"14.","Fordeling av brutto utlån (post 7) på land:",{"$f":"D17","v":"31.03.2025"},{"$f":"E17","v":"31.03.2024"}]
[null,null,null,"mill. kr","mill. kr"]
["ccr_27",null,"Norge (= 7.1)",null,null,{"$f":"IF(D45<>D20,\"Skal være lik 7.1\",\"\")","v":""}]
["ccr_28",null,"Sverige"]
["ccr_29",null,"Danmark"]
["ccr_30",null,"Finland"]
["ccr_31",null,"Andre land"]
["ccr_32",null,"Sum (= 7.)",null,null,{"$f":"IF(D50<>D19,\"Skal være lik 7.\",\"\")","v":""}]
[]
[null,null,"Del 2: Salg av porteføljer:",{"$f":"D6","v":"1.kvartal 2025"},{"$f":"E6","v":"1.kvartal 2024"}]
[null,null,null,"mill. kr","mill. kr"]
["ccr_33","15.","Brutto utlån solgt til annet foretak",null,null,null,null,{"$f":"IF(D54>0,\"Navn på foretak solgt til og volum spesifiseres i egen arkfane\",IF(E54>0,\"Navn på foretak solgt til og volum spesifiseres i egen arkfane\",\"\"))","v":""}]
["ccr_34","15.1","       Herav Norge"]
["ccr_35","15.2","Tilbakeførte tap som følge av salg, som påvirker resultatet"]
["ccr_36","15.3","Annen resultateffekt som følge av salg av portefølje"]
["ccr_37","15.4","Brutto mislighold per 90 dager i solgt portefølje"]
[null,null,"Fordeling av post 15 på enkeltforetak fylles ut i arkfane \"Fordeling av post 15\""]

{"sheet":"Årlig","index":2,"n_rows":103,"n_cols":8,"rows_kept":103,"cut":false,"hidden":true,"merged":[[0,2,2,4]]}
[null,null,"Skjema for rapportering av forbrukslån  (Lån uten sikkerhet til personkunder) "]
[]
[]
[]
[null,null,{"$f":"Forside!B10","v":0}]
[null,null,"Del 1: Regnskapstall forbrukslån",{"$f":"Forside!$F$12","v":2025},{"$f":"Forside!$F$12-1","v":2024}]
[null,null,null,"mill. kr","mill. kr"]
["ccr_1","1.","Renteinntekter"]
["ccr_2","2.","Rentekostnader",null,null,null,null,{"$f":"IF(D9 < 0,\"Post 2 skal føres med positivt fortegn\",IF(E9<0,\"Post 2 skal føres med positivt fortegn \",\"\"))","v":""}]
["ccr_3","3.","Netto renteinntekter (1 - 2)",null,null,null,null,{"$f":"IF(ISBLANK(D10),\"Post 3 må fylles ut\",IF(ISBLANK(E10),\"Post 3 må fylles ut\",\"\"))","v":"Post 3 må fylles ut"}]
["ccr_4","4.","Tap på utlån (4.1 + 4.2)"]
["ccr_5","4.1","Tap kredittkort"]
["ccr_6","4.2","Tap andre forbrukslån"]
["ccr_7",5,"Resultat av ordinær drift før skatt",null,null,null,null,{"$f":"IF(ISBLANK(D14),\"Post 5 må fylles ut\",IF(ISBLANK(E14),\"Post 5 må fylles ut\",\"\"))","v":"Post 5 må fylles ut"}]
[]
["ccr_8","6.","Gjennomsnittlig forvaltningskapital",null,null,null,null,{"$f":"IF(ISBLANK(D16),\"Post 6 må fylles ut\",IF(ISBLANK(E16),\"Post 6 må fylles ut\",\"\"))","v":"Post 6 må fylles ut"}]
[null,null,null,{"$f":"Forside!D12","v":"31.03.2025"},{"$f":"CONCATENATE(LEFT(D17,6),CONCATENATE(RIGHT(E6,4)))","v":"31.03.2024"}]
[null,null,null,"mill. kr","mill. kr"]
["ccr_9","7.","Brutto utlån kunder (7.2 + 7.6) ",null,null,{"$f":"D21+D25","v":0},{"$f":"E21+E25","v":0},{"$f":"IF(OR(ROUND(D19,0)<>ROUND(F19,0),ROUND(E19,0)<>ROUND(G19,0)),\"Må fylles ut! Er lik 7.2+7.6\",\"\")","v":""}]
["ccr_10","7.1","    Herav Norge (7.3 + 7.6)",null,null,{"$f":"D22+D26","v":0},{"$f":"E22+E26","v":0},{"$f":"IF(OR(ROUND(D20,0)<>ROUND(F20,0),ROUND(E20,0)<>ROUND(G20,0)),\"Brutto utlån kunder avviker fra summen av postene 7.3+7.7\",\"\")","v":""}]
["ccr_11","7.2","Kredittkort",null,null,null,null,{"$f":"IF(AND(D21<>0,D22=\"\"),\"Må fylle ut post 7.3\",IF(AND(E21<>0,E22=\"\"),\"Må fylle ut post 7.3\",\"\"))","v":""}]
["ccr_12","7.3","    Herav Norge",null,null,null,null,{"$f":"IF(AND(D22<>0,D21=\"\"),\"Må fylles ut post 7.2\",IF(AND(E22<>0,E21=\"\"),\"Må fylles ut post 7.2\",\"\"))","v":""}]
["ccr_13","7.4","Rentebærende volum kredittkort (av 7.2 ) "]
["ccr_68","7.5","Rentebærende volum kredittkort Norge (av 7.3)"]
["ccr_14","7.6","Andre forbrukslån",null,null,null,55,{"$f":"IF(AND(D25<>0,D26=\"\"),\"Må fylles ut post 7.7\",IF(AND(E25<>0,E26=\"\"),\"Må fylles ut post 7.7\",\"\"))","v":""}]
["ccr_15","7.7","    Herav Norge",null,null,null,null,{"$f":"IF(AND(D26<>0,D25=\"\"),\"Må fylles ut post 7.6\",IF(AND(E26<>0,E25=\"\"),\"Må fylles ut post 7.6\",\"\"))","v":""}]
[]
["ccr_16","8. ","Brutto misligholdte engasjementer, 90 dager 1) (8.2 + 8.4)",null,null,{"$f":"D30+D32","v":0},{"$f":"E30+E32","v":0},{"$f":"IF(OR(ROUND(D28,0)<>ROUND(F28,0),ROUND(E28,0)<>ROUND(G28,0)),\"Må fylles ut! Er lik 8.2+8.4\",IF(AND(D28<>0,D29=\"\"),\"Må fylles ut post 8.1\",\"\"))","v":""}]
["ccr_17","8.1","    Herav Norge (8.3 + 8.5)",null,null,{"$f":"D31+D33","v":0},{"$f":"E31+E33","v":0},{"$f":"IF(OR(ROUND(D29,0)<>ROUND(F29,0),ROUND(E29,0)<>ROUND(G29,0)),\"Må fylles ut! Er lik 8.3+8.5\",IF(AND(D29<>0,D28=\"\"),\"Må fylles ut post 8\",\"\"))","v":""}]
["ccr_18","8.2","Mislighold kredittkort, 90 dager",null,null,null,null,{"$f":"IF(AND(D30<>0,D31=\"\"),\"Må fylles ut 8.3\",\"\")","v":""}]
["ccr_19","8.3","    Herav Norge ",null,null,null,null,{"$f":"IF(AND(D31<>0,D30=\"\"),\"Må fylles ut post 8.2\",\"\")","v":""}]
["ccr_20","8.4","Mislighold andre forbrukslån, 90 dager ",null,null,null,null,{"$f":"IF(AND(D32<>0,D33=\"\"),\"Må fylles ut post 8.5\",\"\")","v":""}]
["ccr_21","8.5","    Herav Norge ",null,null,null,null,{"$f":"IF(AND(D33<>0,D32=\"\"),\"Må fylles ut post 8.4\",\"\")","v":""}]
[]
["ccr_22","9.","Betalingslettelse med nedskrivning "]
["ccr_23","10.","Betalingslettelse uten nedskrivning"]
[]
["ccr_24","11.","Tapsnedskrivninger steg 1",null,null,null,null,{"$f":"IF(D38>0,\"Skal være negativ\",IF(E38>0,\"Skal være negativ\",\"\"))","v":""}]
["ccr_25","12.","Tapsnedskrivninger steg 2/Gruppenedskrivninger",null,null,null,null,{"$f":"IF(D39>0,\"Skal være negativ\",IF(E39>0,\"Skal være negativ\",\"\"))","v":""}]
["ccr_26","13.","Tapsnedskrivninger steg 3/Individuelle nedskrivninger ",null,null,null,null,""]
[null,null,"1) Jf. veiledningen til ORBOF-rapport 12, kapittel 17, og kapitalkravsforskriften §10-1"]
[]
[null,"14.","Fordeling av brutto utlån (post 7) på land:",{"$f":"D17","v":"31.03.2025"},{"$f":"E17","v":"31.03.2024"}]
[null,null,null,"mill. kr","mill. kr"]
["ccr_27",null,"Norge (= 7.1)",null,null,{"$f":"IF(D45<>D20,\"Skal være lik 7.1\",\"\")","v":""}]
["ccr_28",null,"Sverige"]
["ccr_29",null,"Danmark"]
["ccr_30",null,"Finland"]
["ccr_31",null,"Andre land"]
["ccr_32",null,"Sum (= 7.)",null,null,{"$f":"IF(D50<>D19,\"Skal være lik 7.\",\"\")","v":""}]
[]
[null,null,"Del 2: Salg av porteføljer:",{"$f":"D6","v":2025},{"$f":"E6","v":2024}]
[null,null,null,"mill. kr","mill. kr"]
["ccr_33","15.","Brutto utlån solgt til annet foretak",null,null,null,null,{"$f":"IF(D54>0,\"Navn på foretak solgt til og volum spesifiseres i egen arkfane\",IF(E54>0,\"Navn på foretak solgt til og volum spesifiseres i egen arkfane\",\"\"))","v":""}]
["ccr_34","15.1","       Herav Norge"]
["ccr_35","15.2","Tilbakeførte tap som følge av salg, som påvirker resultatet"]
["ccr_36","15.3","Annen resultateffekt som følge av salg av portefølje"]
["ccr_37","15.4","Brutto mislighold per 90 dager i solgt portefølje"]
[null,null,"Fordeling av post 15 på enkeltforetak fylles ut i arkfane \"Fordeling av post 15\""]
[]
[null,null,"Del 3: Tilleggsopplysninger (år): "]
[]
[null,null,"Antall lånesøknader og avslag",{"$f":"D52","v":2025},{"$f":"E52","v":2024}]
["ccr_38","16.","Antall lånesøknader til behandling",null,null,{"$f":"D65+D66","v":0},{"$f":"E65+E66","v":0},{"$f":"IF(OR(ROUND(D64,0)<>ROUND(F64,0),ROUND(E64,0)<>ROUND(G64,0)),\"Må fylles ut! Er lik 16.1+16.2\",\"\")","v":""}]
["ccr_39","16.1","    Antall lånesøknader kredittkort"]
["ccr_40","16.2","    Antall lånesøknader andre forbrukslån"]
["ccr_41","17.","Antall avslåtte lånesøknader ",null,null,{"$f":"D68+D69","v":0},{"$f":"E68+E69","v":0},{"$f":"IF(OR(ROUND(D67,0)<>ROUND(F67,0),ROUND(E67,0)<>ROUND(G67,0)),\"Må fylles ut! Er lik 17.1+17.2\",\"\")","v":""}]
["ccr_42","17.1","    Antall avslåtte søknader kredittkort"]
["ccr_43","17.2","    Antall avslåtte søknader andre forbrukslån"]
[]
[null,null,"Brutto utlån Norge (7.3 + 7.6) ",{"$f":"D17","v":"31.03.2025"},{"$f":"E17","v":"31.03.2024"}]
[null,null,"Fordelt på låntakers alder ","mill. kr","mill. kr"]
[null,null,"kredittkort",{"$f":"SUM(D74:D78)","v":0},{"$f":"SUM(E74:E78)","v":0},{"$f":"IF(D73<>D79,\"Summen av 18.1 til 18.5 skal være lik 18.\",\"\")","v":""},{"$f":"IF(E73<>E79,\"Summen av 18.1 til 18.5 skal være lik 18.\",\"\")","v":""}]
["ccr_44","18.1","18-29 år"]
["ccr_45","18.2","30-39 år"]
["ccr_46","18.3","40-49 år"]
["ccr_47","18.4","50-59 år"]
["ccr_48","18.5","over 60 år"]
["ccr_49","18.","Sum ",null,null,{"$f":"IF(D79<>D22,\"Sum 18. skal være lik 7.3\",\"\")","v":""},{"$f":"IF(E79<>E22,\"Sum 18. skal være lik 7.3\",\"\")","v":""}]
[null,null,"andre forbrukslån",{"$f":"SUM(D81:D85)","v":0},{"$f":"SUM(E81:E85)","v":0},{"$f":"IF(D80<>D86,\"Summen av 18.1 til 18.5 skal være lik 18.\",\"\")","v":""},{"$f":"IF(E80<>E86,\"Summen av 18.1 til 18.5 skal være lik 18.\",\"\")","v":""}]
["ccr_50","18.1","18-29 år"]
["ccr_51","18.2","30-39 år"]
["ccr_52","18.3","40-49 år"]
["ccr_53","18.4","50-59 år"]
["ccr_54","18.5","over 60 år"]
["ccr_55","18.","Sum ",null,null,{"$f":"IF(D86<>D26,\"Sum 18. skal være lik 7.7\",\"\")","v":""},{"$f":"IF(E86<>E26,\"Sum 18. skal være lik 7.7\",\"\")","v":""}]
[null,null,null,null,null,{"$f":"IF(F86<>E22,\"Sum 18. skal være lik 7.3\",\"\")","v":""},{"$f":"IF(G86<>E26,\"Sum 18. skal være lik 7.6\",\"\")","v":""}]
[null,null,"Misligholdte engasjementer Norge, 90 dager (8.3 + 8.5)",{"$f":"D17","v":"31.03.2025"},{"$f":"E17","v":"31.03.2024"}]
[null,null,"Fordelt på låntakers alder","mill. kr","mill. kr"]
[null,null,"kredittkort",{"$f":"SUM(D91:D95)","v":0},{"$f":"SUM(E91:E95)","v":0},{"$f":"IF(D90<>D96,\"Summen av 19.1 til 19.5 skal være lik 19.\",\"\")","v":""},{"$f":"IF(E90<>E96,\"Summen av 19.1 til 19.5 skal være lik 19.\",\"\")","v":""}]
["ccr_56","19.1","18-29 år"]
["ccr_57","19.2","30-39 år"]
["ccr_58","19.3","40-49 år"]
["ccr_59","19.4","50-59 år"]
["ccr_60","19.5","over 60 år"]
["ccr_61","19.","Sum ",null,null,{"$f":"IF(D96<>D31,\"Sum 18. skal være lik 8.3\",\"\")","v":""},{"$f":"IF(E96<>E31,\"Sum 18. skal være lik 8.3\",\"\")","v":""}]
[null,null,"andre forbrukslån",{"$f":"SUM(D98:D102)","v":0},{"$f":"SUM(E98:E102)","v":0},{"$f":"IF(D97<>D103,\"Summen av 19.1 til 19.5 skal være lik 19.\",\"\")","v":""},{"$f":"IF(E97<>E103,\"Summen av 19.1 til 19.5 skal være lik 19.\",\"\")","v":""}]
["ccr_62","19.1","18-29 år"]
["ccr_63","19.2","30-39 år"]
["ccr_64","19.3","40-49 år"]
["ccr_65","19.4","50-59 år"]
["ccr_66","19.5","over 60 år"]
["ccr_67","19.","Sum ",null,null,{"$f":"IF(D103<>D33,\"Sum 19. skal være lik 8.5\",\"\")","v":""},{"$f":"IF(E103<>E33,\"Sum 19. skal være lik 8.5\",\"\")","v":""}]

{"sheet":"Fordeling av post 15","index":3,"n_rows":7,"n_cols":5,"rows_kept":7,"cut":false,"hidden":false,"merged":[[5,1,6,1],[5,2,6,2]]}
[]
[null,"Skjema for rapportering av forbrukslån  (Lån uten sikkerhet til personkunder) "]
[]
[null,"Fordeling av post 15 på enkeltforetak:"]
[null,{"$f":"Forside!B10","v":0}]
[null,"Organisajonsnummer  Bruk LEI-kode hvis ikke org.nr.","Fullstendig navn på foretak som portefølje er solgt til:",{"$f":"IF(Forside!G12=\"År\",Forside!F12, Forside!G12&\" \"&Forside!F12)","v":"1.kvartal 2025"},{"$f":"IF(Forside!G12=\"År\",Forside!F12-1, Forside!G12&\" \"&Forside!F12-1)","v":"1.kvartal 2024"}]
[null,null,null,"mill. kr","mill. kr"]

{"sheet":"nfl_01","index":4,"n_rows":46,"n_cols":9,"rows_kept":46,"cut":false,"hidden":true,"merged":[[40,2,44,2],[40,3,40,5],[41,4,41,5],[42,3,43,3],[42,4,42,5],[43,4,43,5],[44,3,44,5],[37,2,39,2],[37,3,37,5],[38,3,38,5],[39,3,39,5],[29,2,29,5],[30,2,34,2],[30,3,30,5],[31,3,31,5],[32,4,32,5],[33,3,33,5],[34,4,34,5],[35,2,36,2],[35,3,35,5],[36,3,36,5],[6,7,6,8],[9,2,9,5],[10,2,10,5],[11,2,11,5],[12,2,12,5],[13,2,14,2],[13,3,13,5],[14,3,14,5],[15,2,15,5],[16,2,16,5],[17,2,17,5],[18,3,22,3],[18,4,18,5],[19,4,19,5],[20,4,20,5],[21,4,21,5],[22,4,22,5],[28,4,28,5],[18,2,28,2],[23,3,23,5],[24,3,26,3],[24,4,24,5],[25,4,25,5],[27,3,27,5]]}
[null,null,"nfl_01. Regnskapstall forbrukslån"]
[]
[]
[]
[]
[]
[null,null,null,null,null,null,null,"Beløp (mill.kr)"]
[null,null,null,null,null,null,null,{"$f":"Forside!AB1&\" \" & Forside!AA1","v":"pr. 31.03.2025"},{"$f":"Forside!AB1& \" \" &Forside!AA2","v":"pr. 31.03.2024"}]
[null,null,null,null,null,null,"Code","0010","0020"]
["ccr_1","1.","Renteinntekter",null,null,null,"0010",{"$f":"IF(MONTH(Forside!$D$12)=12,IF(VLOOKUP(A10,Årlig!$A:$E,4,0)=\"\",\"\",VLOOKUP(A10,Årlig!$A:$E,4,0)),IF(VLOOKUP(A10,Kvartal!$A:$E,4,0)=\"\",\"\",VLOOKUP(A10,Kvartal!$A:$E,4,0)))","v":""},{"$f":"IF(MONTH(Forside!$D$12)=12,IF(VLOOKUP(A10,Årlig!$A:$E,5,0)=\"\",\"\",VLOOKUP(A10,Årlig!$A:$E,5,0)),IF(VLOOKUP(A10,Kvartal!$A:$E,5,0)=\"\",\"\",VLOOKUP(A10,Kvartal!$A:$E,5,0)))","v":""}]
["ccr_2","2.","Rentekostnader",null,null,null,"0020",{"$f":"IF(MONTH(Forside!$D$12)=12,IF(VLOOKUP(A11,Årlig!$A:$E,4,0)=\"\",\"\",VLOOKUP(A11,Årlig!$A:$E,4,0)),IF(VLOOKUP(A11,Kvartal!$A:$E,4,0)=\"\",\"\",VLOOKUP(A11,Kvartal!$A:$E,4,0)))","v":""},{"$f":"IF(MONTH(Forside!$D$12)=12,IF(VLOOKUP(A11,Årlig!$A:$E,5,0)=\"\",\"\",VLOOKUP(A11,Årlig!$A:$E,5,0)),IF(VLOOKUP(A11,Kvartal!$A:$E,5,0)=\"\",\"\",VLOOKUP(A11,Kvartal!$A:$E,5,0)))","v":""}]
["ccr_3","3.","Netto renteinntekter (Code 0010 - Code 0020)",null,null,null,"0030",{"$f":"IF(MONTH(Forside!$D$12)=12,IF(VLOOKUP(A12,Årlig!$A:$E,4,0)=\"\",\"\",VLOOKUP(A12,Årlig!$A:$E,4,0)),IF(VLOOKUP(A12,Kvartal!$A:$E,4,0)=\"\",\"\",VLOOKUP(A12,Kvartal!$A:$E,4,0)))","v":""},{"$f":"IF(MONTH(Forside!$D$12)=12,IF(VLOOKUP(A12,Årlig!$A:$E,5,0)=\"\",\"\",VLOOKUP(A12,Årlig!$A:$E,5,0)),IF(VLOOKUP(A12,Kvartal!$A:$E,5,0)=\"\",\"\",VLOOKUP(A12,Kvartal!$A:$E,5,0)))","v":""}]
["ccr_4","4.","Tap på utlån (Code 0050 + Code 0060)",null,null,null,"0040",{"$f":"IF(MONTH(Forside!$D$12)=12,IF(VLOOKUP(A13,Årlig!$A:$E,4,0)=\"\",\"\",VLOOKUP(A13,Årlig!$A:$E,4,0)),IF(VLOOKUP(A13,Kvartal!$A:$E,4,0)=\"\",\"\",VLOOKUP(A13,Kvartal!$A:$E,4,0)))","v":""},{"$f":"IF(MONTH(Forside!$D$12)=12,IF(VLOOKUP(A13,Årlig!$A:$E,5,0)=\"\",\"\",VLOOKUP(A13,Årlig!$A:$E,5,0)),IF(VLOOKUP(A13,Kvartal!$A:$E,5,0)=\"\",\"\",VLOOKUP(A13,Kvartal!$A:$E,5,0)))","v":""}]
["ccr_5","4.1","Tap på utlån","Kredittkort",null,null,"0050",{"$f":"IF(MONTH(Forside!$D$12)=12,IF(VLOOKUP(A14,Årlig!$A:$E,4,0)=\"\",\"\",VLOOKUP(A14,Årlig!$A:$E,4,0)),IF(VLOOKUP(A14,Kvartal!$A:$E,4,0)=\"\",\"\",VLOOKUP(A14,Kvartal!$A:$E,4,0)))","v":""},{"$f":"IF(MONTH(Forside!$D$12)=12,IF(VLOOKUP(A14,Årlig!$A:$E,5,0)=\"\",\"\",VLOOKUP(A14,Årlig!$A:$E,5,0)),IF(VLOOKUP(A14,Kvartal!$A:$E,5,0)=\"\",\"\",VLOOKUP(A14,Kvartal!$A:$E,5,0)))","v":""}]
["ccr_6","4.2",null,"Andre forbrukslån",null,null,"0060",{"$f":"IF(MONTH(Forside!$D$12)=12,IF(VLOOKUP(A15,Årlig!$A:$E,4,0)=\"\",\"\",VLOOKUP(A15,Årlig!$A:$E,4,0)),IF(VLOOKUP(A15,Kvartal!$A:$E,4,0)=\"\",\"\",VLOOKUP(A15,Kvartal!$A:$E,4,0)))","v":""},{"$f":"IF(MONTH(Forside!$D$12)=12,IF(VLOOKUP(A15,Årlig!$A:$E,5,0)=\"\",\"\",VLOOKUP(A15,Årlig!$A:$E,5,0)),IF(VLOOKUP(A15,Kvartal!$A:$E,5,0)=\"\",\"\",VLOOKUP(A15,Kvartal!$A:$E,5,0)))","v":""}]
["ccr_7",5,"Resultat av ordinær drift før skatt",null,null,null,"0070",{"$f":"IF(MONTH(Forside!$D$12)=12,IF(VLOOKUP(A16,Årlig!$A:$E,4,0)=\"\",\"\",VLOOKUP(A16,Årlig!$A:$E,4,0)),IF(VLOOKUP(A16,Kvartal!$A:$E,4,0)=\"\",\"\",VLOOKUP(A16,Kvartal!$A:$E,4,0)))","v":""},{"$f":"IF(MONTH(Forside!$D$12)=12,IF(VLOOKUP(A16,Årlig!$A:$E,5,0)=\"\",\"\",VLOOKUP(A16,Årlig!$A:$E,5,0)),IF(VLOOKUP(A16,Kvartal!$A:$E,5,0)=\"\",\"\",VLOOKUP(A16,Kvartal!$A:$E,5,0)))","v":""}]
["ccr_8","6.","Gjennomsnittlig forvaltningskapital",null,null,null,"0080",{"$f":"IF(MONTH(Forside!$D$12)=12,IF(VLOOKUP(A17,Årlig!$A:$E,4,0)=\"\",\"\",VLOOKUP(A17,Årlig!$A:$E,4,0)),IF(VLOOKUP(A17,Kvartal!$A:$E,4,0)=\"\",\"\",VLOOKUP(A17,Kvartal!$A:$E,4,0)))","v":""},{"$f":"IF(MONTH(Forside!$D$12)=12,IF(VLOOKUP(A17,Årlig!$A:$E,5,0)=\"\",\"\",VLOOKUP(A17,Årlig!$A:$E,5,0)),IF(VLOOKUP(A17,Kvartal!$A:$E,5,0)=\"\",\"\",VLOOKUP(A17,Kvartal!$A:$E,5,0)))","v":""}]
["ccr_9","7.","Brutto utlån kunder (Code 0150 + Code 0190) ",null,null,null,"0090",{"$f":"IF(MONTH(Forside!$D$12)=12,IF(VLOOKUP(A18,Årlig!$A:$E,4,0)=\"\",\"\",VLOOKUP(A18,Årlig!$A:$E,4,0)),IF(VLOOKUP(A18,Kvartal!$A:$E,4,0)=\"\",\"\",VLOOKUP(A18,Kvartal!$A:$E,4,0)))","v":""},{"$f":"IF(MONTH(Forside!$D$12)=12,IF(VLOOKUP(A18,Årlig!$A:$E,5,0)=\"\",\"\",VLOOKUP(A18,Årlig!$A:$E,5,0)),IF(VLOOKUP(A18,Kvartal!$A:$E,5,0)=\"\",\"\",VLOOKUP(A18,Kvartal!$A:$E,5,0)))","v":""}]
["ccr_27",null,"Brutto utlån kunder","Landfordelt","Norge",null,"0100",{"$f":"IF(MONTH(Forside!$D$12)=12,IF(VLOOKUP(A19,Årlig!$A:$E,4,0)=\"\",\"\",VLOOKUP(A19,Årlig!$A:$E,4,0)),IF(VLOOKUP(A19,Kvartal!$A:$E,4,0)=\"\",\"\",VLOOKUP(A19,Kvartal!$A:$E,4,0)))","v":""},{"$f":"IF(MONTH(Forside!$D$12)=12,IF(VLOOKUP(A19,Årlig!$A:$E,5,0)=\"\",\"\",VLOOKUP(A19,Årlig!$A:$E,5,0)),IF(VLOOKUP(A19,Kvartal!$A:$E,5,0)=\"\",\"\",VLOOKUP(A19,Kvartal!$A:$E,5,0)))","v":""}]
["ccr_28",null,null,null,"Sverige",null,"0110",{"$f":"IF(MONTH(Forside!$D$12)=12,IF(VLOOKUP(A20,Årlig!$A:$E,4,0)=\"\",\"\",VLOOKUP(A20,Årlig!$A:$E,4,0)),IF(VLOOKUP(A20,Kvartal!$A:$E,4,0)=\"\",\"\",VLOOKUP(A20,Kvartal!$A:$E,4,0)))","v":""},{"$f":"IF(MONTH(Forside!$D$12)=12,IF(VLOOKUP(A20,Årlig!$A:$E,5,0)=\"\",\"\",VLOOKUP(A20,Årlig!$A:$E,5,0)),IF(VLOOKUP(A20,Kvartal!$A:$E,5,0)=\"\",\"\",VLOOKUP(A20,Kvartal!$A:$E,5,0)))","v":""}]
["ccr_29",null,null,null,"Danmark",null,"0120",{"$f":"IF(MONTH(Forside!$D$12)=12,IF(VLOOKUP(A21,Årlig!$A:$E,4,0)=\"\",\"\",VLOOKUP(A21,Årlig!$A:$E,4,0)),IF(VLOOKUP(A21,Kvartal!$A:$E,4,0)=\"\",\"\",VLOOKUP(A21,Kvartal!$A:$E,4,0)))","v":""},{"$f":"IF(MONTH(Forside!$D$12)=12,IF(VLOOKUP(A21,Årlig!$A:$E,5,0)=\"\",\"\",VLOOKUP(A21,Årlig!$A:$E,5,0)),IF(VLOOKUP(A21,Kvartal!$A:$E,5,0)=\"\",\"\",VLOOKUP(A21,Kvartal!$A:$E,5,0)))","v":""}]
["ccr_30",null,null,null,"Finland",null,"0130",{"$f":"IF(MONTH(Forside!$D$12)=12,IF(VLOOKUP(A22,Årlig!$A:$E,4,0)=\"\",\"\",VLOOKUP(A22,Årlig!$A:$E,4,0)),IF(VLOOKUP(A22,Kvartal!$A:$E,4,0)=\"\",\"\",VLOOKUP(A22,Kvartal!$A:$E,4,0)))","v":""},{"$f":"IF(MONTH(Forside!$D$12)=12,IF(VLOOKUP(A22,Årlig!$A:$E,5,0)=\"\",\"\",VLOOKUP(A22,Årlig!$A:$E,5,0)),IF(VLOOKUP(A22,Kvartal!$A:$E,5,0)=\"\",\"\",VLOOKUP(A22,Kvartal!$A:$E,5,0)))","v":""}]
["ccr_31",null,null,null,"Andre land",null,"0140",{"$f":"IF(MONTH(Forside!$D$12)=12,IF(VLOOKUP(A23,Årlig!$A:$E,4,0)=\"\",\"\",VLOOKUP(A23,Årlig!$A:$E,4,0)),IF(VLOOKUP(A23,Kvartal!$A:$E,4,0)=\"\",\"\",VLOOKUP(A23,Kvartal!$A:$E,4,0)))","v":""},{"$f":"IF(MONTH(Forside!$D$12)=12,IF(VLOOKUP(A23,Årlig!$A:$E,5,0)=\"\",\"\",VLOOKUP(A23,Årlig!$A:$E,5,0)),IF(VLOOKUP(A23,Kvartal!$A:$E,5,0)=\"\",\"\",VLOOKUP(A23,Kvartal!$A:$E,5,0)))","v":""}]
["ccr_11","7.2",null,"Kredittkort",null,null,"0150",{"$f":"IF(MONTH(Forside!$D$12)=12,IF(VLOOKUP(A24,Årlig!$A:$E,4,0)=\"\",\"\",VLOOKUP(A24,Årlig!$A:$E,4,0)),IF(VLOOKUP(A24,Kvartal!$A:$E,4,0)=\"\",\"\",VLOOKUP(A24,Kvartal!$A:$E,4,0)))","v":""},{"$f":"IF(MONTH(Forside!$D$12)=12,IF(VLOOKUP(A24,Årlig!$A:$E,5,0)=\"\",\"\",VLOOKUP(A24,Årlig!$A:$E,5,0)),IF(VLOOKUP(A24,Kvartal!$A:$E,5,0)=\"\",\"\",VLOOKUP(A24,Kvartal!$A:$E,5,0)))","v":""}]
["ccr_12","7.3",null,"Kredittkort","Herav Norge",null,"0160",{"$f":"IF(MONTH(Forside!$D$12)=12,IF(VLOOKUP(A25,Årlig!$A:$E,4,0)=\"\",\"\",VLOOKUP(A25,Årlig!$A:$E,4,0)),IF(VLOOKUP(A25,Kvartal!$A:$E,4,0)=\"\",\"\",VLOOKUP(A25,Kvartal!$A:$E,4,0)))","v":""},{"$f":"IF(MONTH(Forside!$D$12)=12,IF(VLOOKUP(A25,Årlig!$A:$E,5,0)=\"\",\"\",VLOOKUP(A25,Årlig!$A:$E,5,0)),IF(VLOOKUP(A25,Kvartal!$A:$E,5,0)=\"\",\"\",VLOOKUP(A25,Kvartal!$A:$E,5,0)))","v":""}]
["ccr_13","7.4",null,null,"Rentebærende volum",null,"0170",{"$f":"IF(MONTH(Forside!$D$12)=12,IF(VLOOKUP(A26,Årlig!$A:$E,4,0)=\"\",\"\",VLOOKUP(A26,Årlig!$A:$E,4,0)),IF(VLOOKUP(A26,Kvartal!$A:$E,4,0)=\"\",\"\",VLOOKUP(A26,Kvartal!$A:$E,4,0)))","v":""},{"$f":"IF(MONTH(Forside!$D$12)=12,IF(VLOOKUP(A26,Årlig!$A:$E,5,0)=\"\",\"\",VLOOKUP(A26,Årlig!$A:$E,5,0)),IF(VLOOKUP(A26,Kvartal!$A:$E,5,0)=\"\",\"\",VLOOKUP(A26,Kvartal!$A:$E,5,0)))","v":""}]
["ccr_68","7.5",null,null,"Rentebærende volum","Herav Norge","0180",{"$f":"IF(MONTH(Forside!$D$12)=12,IF(VLOOKUP(A27,Årlig!$A:$E,4,0)=\"\",\"\",VLOOKUP(A27,Årlig!$A:$E,4,0)),IF(VLOOKUP(A27,Kvartal!$A:$E,4,0)=\"\",\"\",VLOOKUP(A27,Kvartal!$A:$E,4,0)))","v":""},{"$f":"IF(MONTH(Forside!$D$12)=12,IF(VLOOKUP(A27,Årlig!$A:$E,5,0)=\"\",\"\",VLOOKUP(A27,Årlig!$A:$E,5,0)),IF(VLOOKUP(A27,Kvartal!$A:$E,5,0)=\"\",\"\",VLOOKUP(A27,Kvartal!$A:$E,5,0)))","v":""}]
["ccr_14","7.6",null,"Andre forbrukslån",null,null,"0190",{"$f":"IF(MONTH(Forside!$D$12)=12,IF(VLOOKUP(A28,Årlig!$A:$E,4,0)=\"\",\"\",VLOOKUP(A28,Årlig!$A:$E,4,0)),IF(VLOOKUP(A28,Kvartal!$A:$E,4,0)=\"\",\"\",VLOOKUP(A28,Kvartal!$A:$E,4,0)))","v":""},{"$f":"IF(MONTH(Forside!$D$12)=12,IF(VLOOKUP(A28,Årlig!$A:$E,5,0)=\"\",\"\",VLOOKUP(A28,Årlig!$A:$E,5,0)),IF(VLOOKUP(A28,Kvartal!$A:$E,5,0)=\"\",\"\",VLOOKUP(A28,Kvartal!$A:$E,5,0)))","v":""}]
["ccr_15","7.7",null,"Andre forbrukslån","Herav Norge",null,"0200",{"$f":"IF(MONTH(Forside!$D$12)=12,IF(VLOOKUP(A29,Årlig!$A:$E,4,0)=\"\",\"\",VLOOKUP(A29,Årlig!$A:$E,4,0)),IF(VLOOKUP(A29,Kvartal!$A:$E,4,0)=\"\",\"\",VLOOKUP(A29,Kvartal!$A:$E,4,0)))","v":""},{"$f":"IF(MONTH(Forside!$D$12)=12,IF(VLOOKUP(A29,Årlig!$A:$E,5,0)=\"\",\"\",VLOOKUP(A29,Årlig!$A:$E,5,0)),IF(VLOOKUP(A29,Kvartal!$A:$E,5,0)=\"\",\"\",VLOOKUP(A29,Kvartal!$A:$E,5,0)))","v":""}]
["ccr_16","8. ","Brutto misligholdte engasjementer, 90 dager 1) (Code 0240 + Code 0260)",null,null,null,"0210",{"$f":"IF(MONTH(Forside!$D$12)=12,IF(VLOOKUP(A30,Årlig!$A:$E,4,0)=\"\",\"\",VLOOKUP(A30,Årlig!$A:$E,4,0)),IF(VLOOKUP(A30,Kvartal!$A:$E,4,0)=\"\",\"\",VLOOKUP(A30,Kvartal!$A:$E,4,0)))","v":""},{"$f":"IF(MONTH(Forside!$D$12)=12,IF(VLOOKUP(A30,Årlig!$A:$E,5,0)=\"\",\"\",VLOOKUP(A30,Årlig!$A:$E,5,0)),IF(VLOOKUP(A30,Kvartal!$A:$E,5,0)=\"\",\"\",VLOOKUP(A30,Kvartal!$A:$E,5,0)))","v":""}]
["ccr_17","8.1","Brutto misligholdte engasjementer, 90 dager","Herav Norge (Code 0250 + Code 0270)",null,null,"0220",{"$f":"IF(MONTH(Forside!$D$12)=12,IF(VLOOKUP(A31,Årlig!$A:$E,4,0)=\"\",\"\",VLOOKUP(A31,Årlig!$A:$E,4,0)),IF(VLOOKUP(A31,Kvartal!$A:$E,4,0)=\"\",\"\",VLOOKUP(A31,Kvartal!$A:$E,4,0)))","v":""},{"$f":"IF(MONTH(Forside!$D$12)=12,IF(VLOOKUP(A31,Årlig!$A:$E,5,0)=\"\",\"\",VLOOKUP(A31,Årlig!$A:$E,5,0)),IF(VLOOKUP(A31,Kvartal!$A:$E,5,0)=\"\",\"\",VLOOKUP(A31,Kvartal!$A:$E,5,0)))","v":""}]
["ccr_18","8.2",null,"Kredittkort",null,null,"0230",{"$f":"IF(MONTH(Forside!$D$12)=12,IF(VLOOKUP(A32,Årlig!$A:$E,4,0)=\"\",\"\",VLOOKUP(A32,Årlig!$A:$E,4,0)),IF(VLOOKUP(A32,Kvartal!$A:$E,4,0)=\"\",\"\",VLOOKUP(A32,Kvartal!$A:$E,4,0)))","v":""},{"$f":"IF(MONTH(Forside!$D$12)=12,IF(VLOOKUP(A32,Årlig!$A:$E,5,0)=\"\",\"\",VLOOKUP(A32,Årlig!$A:$E,5,0)),IF(VLOOKUP(A32,Kvartal!$A:$E,5,0)=\"\",\"\",VLOOKUP(A32,Kvartal!$A:$E,5,0)))","v":""}]
["ccr_19","8.3",null,"Kredittkort","Herav Norge ",null,"0240",{"$f":"IF(MONTH(Forside!$D$12)=12,IF(VLOOKUP(A33,Årlig!$A:$E,4,0)=\"\",\"\",VLOOKUP(A33,Årlig!$A:$E,4,0)),IF(VLOOKUP(A33,Kvartal!$A:$E,4,0)=\"\",\"\",VLOOKUP(A33,Kvartal!$A:$E,4,0)))","v":""},{"$f":"IF(MONTH(Forside!$D$12)=12,IF(VLOOKUP(A33,Årlig!$A:$E,5,0)=\"\",\"\",VLOOKUP(A33,Årlig!$A:$E,5,0)),IF(VLOOKUP(A33,Kvartal!$A:$E,5,0)=\"\",\"\",VLOOKUP(A33,Kvartal!$A:$E,5,0)))","v":""}]
["ccr_20","8.4",null,"Andre forbrukslån",null,null,"0250",{"$f":"IF(MONTH(Forside!$D$12)=12,IF(VLOOKUP(A34,Årlig!$A:$E,4,0)=\"\",\"\",VLOOKUP(A34,Årlig!$A:$E,4,0)),IF(VLOOKUP(A34,Kvartal!$A:$E,4,0)=\"\",\"\",VLOOKUP(A34,Kvartal!$A:$E,4,0)))","v":""},{"$f":"IF(MONTH(Forside!$D$12)=12,IF(VLOOKUP(A34,Årlig!$A:$E,5,0)=\"\",\"\",VLOOKUP(A34,Årlig!$A:$E,5,0)),IF(VLOOKUP(A34,Kvartal!$A:$E,5,0)=\"\",\"\",VLOOKUP(A34,Kvartal!$A:$E,5,0)))","v":""}]
["ccr_21","8.5",null,"Andre forbrukslån","Herav Norge",null,"0260",{"$f":"IF(MONTH(Forside!$D$12)=12,IF(VLOOKUP(A35,Årlig!$A:$E,4,0)=\"\",\"\",VLOOKUP(A35,Årlig!$A:$E,4,0)),IF(VLOOKUP(A35,Kvartal!$A:$E,4,0)=\"\",\"\",VLOOKUP(A35,Kvartal!$A:$E,4,0)))","v":""},{"$f":"IF(MONTH(Forside!$D$12)=12,IF(VLOOKUP(A35,Årlig!$A:$E,5,0)=\"\",\"\",VLOOKUP(A35,Årlig!$A:$E,5,0)),IF(VLOOKUP(A35,Kvartal!$A:$E,5,0)=\"\",\"\",VLOOKUP(A35,Kvartal!$A:$E,5,0)))","v":""}]
["ccr_22","9.","Betalingslettelse","med nedskrivning ",null,null,"0270",{"$f":"IF(MONTH(Forside!$D$12)=12,IF(VLOOKUP(A36,Årlig!$A:$E,4,0)=\"\",\"\",VLOOKUP(A36,Årlig!$A:$E,4,0)),IF(VLOOKUP(A36,Kvartal!$A:$E,4,0)=\"\",\"\",VLOOKUP(A36,Kvartal!$A:$E,4,0)))","v":""},{"$f":"IF(MONTH(Forside!$D$12)=12,IF(VLOOKUP(A36,Årlig!$A:$E,5,0)=\"\",\"\",VLOOKUP(A36,Årlig!$A:$E,5,0)),IF(VLOOKUP(A36,Kvartal!$A:$E,5,0)=\"\",\"\",VLOOKUP(A36,Kvartal!$A:$E,5,0)))","v":""}]
["ccr_23","10.",null,"uten nedskrivning",null,null,"0280",{"$f":"IF(MONTH(Forside!$D$12)=12,IF(VLOOKUP(A37,Årlig!$A:$E,4,0)=\"\",\"\",VLOOKUP(A37,Årlig!$A:$E,4,0)),IF(VLOOKUP(A37,Kvartal!$A:$E,4,0)=\"\",\"\",VLOOKUP(A37,Kvartal!$A:$E,4,0)))","v":""},{"$f":"IF(MONTH(Forside!$D$12)=12,IF(VLOOKUP(A37,Årlig!$A:$E,5,0)=\"\",\"\",VLOOKUP(A37,Årlig!$A:$E,5,0)),IF(VLOOKUP(A37,Kvartal!$A:$E,5,0)=\"\",\"\",VLOOKUP(A37,Kvartal!$A:$E,5,0)))","v":""}]
["ccr_24","11.","Tapsnedskrivninger","Steg 1",null,null,"0290",{"$f":"IF(MONTH(Forside!$D$12)=12,IF(VLOOKUP(A38,Årlig!$A:$E,4,0)=\"\",\"\",VLOOKUP(A38,Årlig!$A:$E,4,0)),IF(VLOOKUP(A38,Kvartal!$A:$E,4,0)=\"\",\"\",VLOOKUP(A38,Kvartal!$A:$E,4,0)))","v":""},{"$f":"IF(MONTH(Forside!$D$12)=12,IF(VLOOKUP(A38,Årlig!$A:$E,5,0)=\"\",\"\",VLOOKUP(A38,Årlig!$A:$E,5,0)),IF(VLOOKUP(A38,Kvartal!$A:$E,5,0)=\"\",\"\",VLOOKUP(A38,Kvartal!$A:$E,5,0)))","v":""}]
["ccr_25","12.",null,"Steg 2 - Gruppenedskrivninger",null,null,"0300",{"$f":"IF(MONTH(Forside!$D$12)=12,IF(VLOOKUP(A39,Årlig!$A:$E,4,0)=\"\",\"\",VLOOKUP(A39,Årlig!$A:$E,4,0)),IF(VLOOKUP(A39,Kvartal!$A:$E,4,0)=\"\",\"\",VLOOKUP(A39,Kvartal!$A:$E,4,0)))","v":""},{"$f":"IF(MONTH(Forside!$D$12)=12,IF(VLOOKUP(A39,Årlig!$A:$E,5,0)=\"\",\"\",VLOOKUP(A39,Årlig!$A:$E,5,0)),IF(VLOOKUP(A39,Kvartal!$A:$E,5,0)=\"\",\"\",VLOOKUP(A39,Kvartal!$A:$E,5,0)))","v":""}]
["ccr_26","13.",null,"Steg 3 - Individuelle nedskrivninger ",null,null,"0310",{"$f":"IF(MONTH(Forside!$D$12)=12,IF(VLOOKUP(A40,Årlig!$A:$E,4,0)=\"\",\"\",VLOOKUP(A40,Årlig!$A:$E,4,0)),IF(VLOOKUP(A40,Kvartal!$A:$E,4,0)=\"\",\"\",VLOOKUP(A40,Kvartal!$A:$E,4,0)))","v":""},{"$f":"IF(MONTH(Forside!$D$12)=12,IF(VLOOKUP(A40,Årlig!$A:$E,5,0)=\"\",\"\",VLOOKUP(A40,Årlig!$A:$E,5,0)),IF(VLOOKUP(A40,Kvartal!$A:$E,5,0)=\"\",\"\",VLOOKUP(A40,Kvartal!$A:$E,5,0)))","v":""}]
["ccr_33","15.","Salg av porteføljer til annet foretak","Brutto utlån solgt",null,null,"0320",{"$f":"IF(MONTH(Forside!$D$12)=12,IF(VLOOKUP(A41,Årlig!$A:$E,4,0)=\"\",\"\",VLOOKUP(A41,Årlig!$A:$E,4,0)),IF(VLOOKUP(A41,Kvartal!$A:$E,4,0)=\"\",\"\",VLOOKUP(A41,Kvartal!$A:$E,4,0)))","v":""},{"$f":"IF(MONTH(Forside!$D$12)=12,IF(VLOOKUP(A41,Årlig!$A:$E,5,0)=\"\",\"\",VLOOKUP(A41,Årlig!$A:$E,5,0)),IF(VLOOKUP(A41,Kvartal!$A:$E,5,0)=\"\",\"\",VLOOKUP(A41,Kvartal!$A:$E,5,0)))","v":""}]
["ccr_34","15.1",null,"Brutto utlån solgt","Herav Norge",null,"0330",{"$f":"IF(MONTH(Forside!$D$12)=12,IF(VLOOKUP(A42,Årlig!$A:$E,4,0)=\"\",\"\",VLOOKUP(A42,Årlig!$A:$E,4,0)),IF(VLOOKUP(A42,Kvartal!$A:$E,4,0)=\"\",\"\",VLOOKUP(A42,Kvartal!$A:$E,4,0)))","v":""},{"$f":"IF(MONTH(Forside!$D$12)=12,IF(VLOOKUP(A42,Årlig!$A:$E,5,0)=\"\",\"\",VLOOKUP(A42,Årlig!$A:$E,5,0)),IF(VLOOKUP(A42,Kvartal!$A:$E,5,0)=\"\",\"\",VLOOKUP(A42,Kvartal!$A:$E,5,0)))","v":""}]
["ccr_35","15.2",null,"Resultateffekt","Tilbakeførte tap",null,"0340",{"$f":"IF(MONTH(Forside!$D$12)=12,IF(VLOOKUP(A43,Årlig!$A:$E,4,0)=\"\",\"\",VLOOKUP(A43,Årlig!$A:$E,4,0)),IF(VLOOKUP(A43,Kvartal!$A:$E,4,0)=\"\",\"\",VLOOKUP(A43,Kvartal!$A:$E,4,0)))","v":""},{"$f":"IF(MONTH(Forside!$D$12)=12,IF(VLOOKUP(A43,Årlig!$A:$E,5,0)=\"\",\"\",VLOOKUP(A43,Årlig!$A:$E,5,0)),IF(VLOOKUP(A43,Kvartal!$A:$E,5,0)=\"\",\"\",VLOOKUP(A43,Kvartal!$A:$E,5,0)))","v":""}]
["ccr_36","15.3",null,null,"Annen resultateffekt",null,"0350",{"$f":"IF(MONTH(Forside!$D$12)=12,IF(VLOOKUP(A44,Årlig!$A:$E,4,0)=\"\",\"\",VLOOKUP(A44,Årlig!$A:$E,4,0)),IF(VLOOKUP(A44,Kvartal!$A:$E,4,0)=\"\",\"\",VLOOKUP(A44,Kvartal!$A:$E,4,0)))","v":""},{"$f":"IF(MONTH(Forside!$D$12)=12,IF(VLOOKUP(A44,Årlig!$A:$E,5,0)=\"\",\"\",VLOOKUP(A44,Årlig!$A:$E,5,0)),IF(VLOOKUP(A44,Kvartal!$A:$E,5,0)=\"\",\"\",VLOOKUP(A44,Kvartal!$A:$E,5,0)))","v":""}]
["ccr_37","15.4",null,"Brutto mislighold pr. 90 dager i solgt portefølje",null,null,"0360",{"$f":"IF(MONTH(Forside!$D$12)=12,IF(VLOOKUP(A45,Årlig!$A:$E,4,0)=\"\",\"\",VLOOKUP(A45,Årlig!$A:$E,4,0)),IF(VLOOKUP(A45,Kvartal!$A:$E,4,0)=\"\",\"\",VLOOKUP(A45,Kvartal!$A:$E,4,0)))","v":""},{"$f":"IF(MONTH(Forside!$D$12)=12,IF(VLOOKUP(A45,Årlig!$A:$E,5,0)=\"\",\"\",VLOOKUP(A45,Årlig!$A:$E,5,0)),IF(VLOOKUP(A45,Kvartal!$A:$E,5,0)=\"\",\"\",VLOOKUP(A45,Kvartal!$A:$E,5,0)))","v":""}]
[null,null,"1) Jf. veiledningen til ORBOF-rapport 12, kapittel 17, og kapitalkravsforskriften §10-1"]

{"sheet":"nfl_02","index":5,"n_rows":50,"n_cols":10,"rows_kept":50,"cut":false,"hidden":true,"merged":[[5,6,6,7],[5,8,5,9],[6,8,6,9]]}
[null,null,null,null,null,null,"nfl_02. Fordeling av post 15 (Brutto utlån solgt) pr. foretak"]
[]
[]
[]
[]
[null,null,null,null,null,null,"Foretak som portefølje er solgt til",null,"Brutto utlån solgt"]
[null,null,null,null,null,null,null,null,"Beløp (mill.kr) hittil i år"]
[null,null,null,null,null,null,"Organisasjonsnummer*","Foretaksnavn (fullstendig)",{"$f":"nfl_01!H8","v":"pr. 31.03.2025"},{"$f":"nfl_01!I8","v":"pr. 31.03.2024"}]
[null,null,null,null,null,null,"0010","0020","0030","0040"]
[null,null,null,null,null,null,{"$f":"+IF('Fordeling av post 15'!B8=\"\",\"\",'Fordeling av post 15'!B8)","v":""},{"$f":"+IF('Fordeling av post 15'!C8=\"\",\"\",'Fordeling av post 15'!C8)","v":""},{"$f":"+IF('Fordeling av post 15'!D8=\"\",\"\",'Fordeling av post 15'!D8)","v":""},{"$f":"+IF('Fordeling av post 15'!E8=\"\",\"\",'Fordeling av post 15'!E8)","v":""}]
[null,null,null,null,null,null,{"$f":"+IF('Fordeling av post 15'!B9=\"\",\"\",'Fordeling av post 15'!B9)","v":""},{"$f":"+IF('Fordeling av post 15'!C9=\"\",\"\",'Fordeling av post 15'!C9)","v":""},{"$f":"+IF('Fordeling av post 15'!D9=\"\",\"\",'Fordeling av post 15'!D9)","v":""},{"$f":"+IF('Fordeling av post 15'!E9=\"\",\"\",'Fordeling av post 15'!E9)","v":""}]
[null,null,null,null,null,null,{"$f":"+IF('Fordeling av post 15'!B10=\"\",\"\",'Fordeling av post 15'!B10)","v":""},{"$f":"+IF('Fordeling av post 15'!C10=\"\",\"\",'Fordeling av post 15'!C10)","v":""},{"$f":"+IF('Fordeling av post 15'!D10=\"\",\"\",'Fordeling av post 15'!D10)","v":""},{"$f":"+IF('Fordeling av post 15'!E10=\"\",\"\",'Fordeling av post 15'!E10)","v":""}]
[null,null,null,null,null,null,{"$f":"+IF('Fordeling av post 15'!B11=\"\",\"\",'Fordeling av post 15'!B11)","v":""},{"$f":"+IF('Fordeling av post 15'!C11=\"\",\"\",'Fordeling av post 15'!C11)","v":""},{"$f":"+IF('Fordeling av post 15'!D11=\"\",\"\",'Fordeling av post 15'!D11)","v":""},{"$f":"+IF('Fordeling av post 15'!E11=\"\",\"\",'Fordeling av post 15'!E11)","v":""}]
[null,null,null,null,null,null,{"$f":"+IF('Fordeling av post 15'!B12=\"\",\"\",'Fordeling av post 15'!B12)","v":""},{"$f":"+IF('Fordeling av post 15'!C12=\"\",\"\",'Fordeling av post 15'!C12)","v":""},{"$f":"+IF('Fordeling av post 15'!D12=\"\",\"\",'Fordeling av post 15'!D12)","v":""},{"$f":"+IF('Fordeling av post 15'!E12=\"\",\"\",'Fordeling av post 15'!E12)","v":""}]
[null,null,null,null,null,null,{"$f":"+IF('Fordeling av post 15'!B13=\"\",\"\",'Fordeling av post 15'!B13)","v":""},{"$f":"+IF('Fordeling av post 15'!C13=\"\",\"\",'Fordeling av post 15'!C13)","v":""},{"$f":"+IF('Fordeling av post 15'!D13=\"\",\"\",'Fordeling av post 15'!D13)","v":""},{"$f":"+IF('Fordeling av post 15'!E13=\"\",\"\",'Fordeling av post 15'!E13)","v":""}]
[null,null,null,null,null,null,{"$f":"+IF('Fordeling av post 15'!B14=\"\",\"\",'Fordeling av post 15'!B14)","v":""},{"$f":"+IF('Fordeling av post 15'!C14=\"\",\"\",'Fordeling av post 15'!C14)","v":""},{"$f":"+IF('Fordeling av post 15'!D14=\"\",\"\",'Fordeling av post 15'!D14)","v":""},{"$f":"+IF('Fordeling av post 15'!E14=\"\",\"\",'Fordeling av post 15'!E14)","v":""}]
[null,null,null,null,null,null,{"$f":"+IF('Fordeling av post 15'!B15=\"\",\"\",'Fordeling av post 15'!B15)","v":""},{"$f":"+IF('Fordeling av post 15'!C15=\"\",\"\",'Fordeling av post 15'!C15)","v":""},{"$f":"+IF('Fordeling av post 15'!D15=\"\",\"\",'Fordeling av post 15'!D15)","v":""},{"$f":"+IF('Fordeling av post 15'!E15=\"\",\"\",'Fordeling av post 15'!E15)","v":""}]
[null,null,null,null,null,null,{"$f":"+IF('Fordeling av post 15'!B16=\"\",\"\",'Fordeling av post 15'!B16)","v":""},{"$f":"+IF('Fordeling av post 15'!C16=\"\",\"\",'Fordeling av post 15'!C16)","v":""},{"$f":"+IF('Fordeling av post 15'!D16=\"\",\"\",'Fordeling av post 15'!D16)","v":""},{"$f":"+IF('Fordeling av post 15'!E16=\"\",\"\",'Fordeling av post 15'!E16)","v":""}]
[null,null,null,null,null,null,{"$f":"+IF('Fordeling av post 15'!B17=\"\",\"\",'Fordeling av post 15'!B17)","v":""},{"$f":"+IF('Fordeling av post 15'!C17=\"\",\"\",'Fordeling av post 15'!C17)","v":""},{"$f":"+IF('Fordeling av post 15'!D17=\"\",\"\",'Fordeling av post 15'!D17)","v":""},{"$f":"+IF('Fordeling av post 15'!E17=\"\",\"\",'Fordeling av post 15'!E17)","v":""}]
[null,null,null,null,null,null,{"$f":"+IF('Fordeling av post 15'!B18=\"\",\"\",'Fordeling av post 15'!B18)","v":""},{"$f":"+IF('Fordeling av post 15'!C18=\"\",\"\",'Fordeling av post 15'!C18)","v":""},{"$f":"+IF('Fordeling av post 15'!D18=\"\",\"\",'Fordeling av post 15'!D18)","v":""},{"$f":"+IF('Fordeling av post 15'!E18=\"\",\"\",'Fordeling av post 15'!E18)","v":""}]
[null,null,null,null,null,null,{"$f":"+IF('Fordeling av post 15'!B19=\"\",\"\",'Fordeling av post 15'!B19)","v":""},{"$f":"+IF('Fordeling av post 15'!C19=\"\",\"\",'Fordeling av post 15'!C19)","v":""},{"$f":"+IF('Fordeling av post 15'!D19=\"\",\"\",'Fordeling av post 15'!D19)","v":""},{"$f":"+IF('Fordeling av post 15'!E19=\"\",\"\",'Fordeling av post 15'!E19)","v":""}]
[null,null,null,null,null,null,{"$f":"+IF('Fordeling av post 15'!B20=\"\",\"\",'Fordeling av post 15'!B20)","v":""},{"$f":"+IF('Fordeling av post 15'!C20=\"\",\"\",'Fordeling av post 15'!C20)","v":""},{"$f":"+IF('Fordeling av post 15'!D20=\"\",\"\",'Fordeling av post 15'!D20)","v":""},{"$f":"+IF('Fordeling av post 15'!E20=\"\",\"\",'Fordeling av post 15'!E20)","v":""}]
[null,null,null,null,null,null,{"$f":"+IF('Fordeling av post 15'!B21=\"\",\"\",'Fordeling av post 15'!B21)","v":""},{"$f":"+IF('Fordeling av post 15'!C21=\"\",\"\",'Fordeling av post 15'!C21)","v":""},{"$f":"+IF('Fordeling av post 15'!D21=\"\",\"\",'Fordeling av post 15'!D21)","v":""},{"$f":"+IF('Fordeling av post 15'!E21=\"\",\"\",'Fordeling av post 15'!E21)","v":""}]
[null,null,null,null,null,null,{"$f":"+IF('Fordeling av post 15'!B22=\"\",\"\",'Fordeling av post 15'!B22)","v":""},{"$f":"+IF('Fordeling av post 15'!C22=\"\",\"\",'Fordeling av post 15'!C22)","v":""},{"$f":"+IF('Fordeling av post 15'!D22=\"\",\"\",'Fordeling av post 15'!D22)","v":""},{"$f":"+IF('Fordeling av post 15'!E22=\"\",\"\",'Fordeling av post 15'!E22)","v":""}]
[null,null,null,null,null,null,{"$f":"+IF('Fordeling av post 15'!B23=\"\",\"\",'Fordeling av post 15'!B23)","v":""},{"$f":"+IF('Fordeling av post 15'!C23=\"\",\"\",'Fordeling av post 15'!C23)","v":""},{"$f":"+IF('Fordeling av post 15'!D23=\"\",\"\",'Fordeling av post 15'!D23)","v":""},{"$f":"+IF('Fordeling av post 15'!E23=\"\",\"\",'Fordeling av post 15'!E23)","v":""}]
[null,null,null,null,null,null,{"$f":"+IF('Fordeling av post 15'!B24=\"\",\"\",'Fordeling av post 15'!B24)","v":""},{"$f":"+IF('Fordeling av post 15'!C24=\"\",\"\",'Fordeling av post 15'!C24)","v":""},{"$f":"+IF('Fordeling av post 15'!D24=\"\",\"\",'Fordeling av post 15'!D24)","v":""},{"$f":"+IF('Fordeling av post 15'!E24=\"\",\"\",'Fordeling av post 15'!E24)","v":""}]
[null,null,null,null,null,null,{"$f":"+IF('Fordeling av post 15'!B25=\"\",\"\",'Fordeling av post 15'!B25)","v":""},{"$f":"+IF('Fordeling av post 15'!C25=\"\",\"\",'Fordeling av post 15'!C25)","v":""},{"$f":"+IF('Fordeling av post 15'!D25=\"\",\"\",'Fordeling av post 15'!D25)","v":""},{"$f":"+IF('Fordeling av post 15'!E25=\"\",\"\",'Fordeling av post 15'!E25)","v":""}]
[null,null,null,null,null,null,{"$f":"+IF('Fordeling av post 15'!B26=\"\",\"\",'Fordeling av post 15'!B26)","v":""},{"$f":"+IF('Fordeling av post 15'!C26=\"\",\"\",'Fordeling av post 15'!C26)","v":""},{"$f":"+IF('Fordeling av post 15'!D26=\"\",\"\",'Fordeling av post 15'!D26)","v":""},{"$f":"+IF('Fordeling av post 15'!E26=\"\",\"\",'Fordeling av post 15'!E26)","v":""}]
[null,null,null,null,null,null,{"$f":"+IF('Fordeling av post 15'!B27=\"\",\"\",'Fordeling av post 15'!B27)","v":""},{"$f":"+IF('Fordeling av post 15'!C27=\"\",\"\",'Fordeling av post 15'!C27)","v":""},{"$f":"+IF('Fordeling av post 15'!D27=\"\",\"\",'Fordeling av post 15'!D27)","v":""},{"$f":"+IF('Fordeling av post 15'!E27=\"\",\"\",'Fordeling av post 15'!E27)","v":""}]
[null,null,null,null,null,null,{"$f":"+IF('Fordeling av post 15'!B28=\"\",\"\",'Fordeling av post 15'!B28)","v":""},{"$f":"+IF('Fordeling av post 15'!C28=\"\",\"\",'Fordeling av post 15'!C28)","v":""},{"$f":"+IF('Fordeling av post 15'!D28=\"\",\"\",'Fordeling av post 15'!D28)","v":""},{"$f":"+IF('Fordeling av post 15'!E28=\"\",\"\",'Fordeling av post 15'!E28)","v":""}]
[null,null,null,null,null,null,{"$f":"+IF('Fordeling av post 15'!B29=\"\",\"\",'Fordeling av post 15'!B29)","v":""},{"$f":"+IF('Fordeling av post 15'!C29=\"\",\"\",'Fordeling av post 15'!C29)","v":""},{"$f":"+IF('Fordeling av post 15'!D29=\"\",\"\",'Fordeling av post 15'!D29)","v":""},{"$f":"+IF('Fordeling av post 15'!E29=\"\",\"\",'Fordeling av post 15'!E29)","v":""}]
[null,null,null,null,null,null,{"$f":"+IF('Fordeling av post 15'!B30=\"\",\"\",'Fordeling av post 15'!B30)","v":""},{"$f":"+IF('Fordeling av post 15'!C30=\"\",\"\",'Fordeling av post 15'!C30)","v":""},{"$f":"+IF('Fordeling av post 15'!D30=\"\",\"\",'Fordeling av post 15'!D30)","v":""},{"$f":"+IF('Fordeling av post 15'!E30=\"\",\"\",'Fordeling av post 15'!E30)","v":""}]
[null,null,null,null,null,null,{"$f":"+IF('Fordeling av post 15'!B31=\"\",\"\",'Fordeling av post 15'!B31)","v":""},{"$f":"+IF('Fordeling av post 15'!C31=\"\",\"\",'Fordeling av post 15'!C31)","v":""},{"$f":"+IF('Fordeling av post 15'!D31=\"\",\"\",'Fordeling av post 15'!D31)","v":""},{"$f":"+IF('Fordeling av post 15'!E31=\"\",\"\",'Fordeling av post 15'!E31)","v":""}]
[null,null,null,null,null,null,{"$f":"+IF('Fordeling av post 15'!B32=\"\",\"\",'Fordeling av post 15'!B32)","v":""},{"$f":"+IF('Fordeling av post 15'!C32=\"\",\"\",'Fordeling av post 15'!C32)","v":""},{"$f":"+IF('Fordeling av post 15'!D32=\"\",\"\",'Fordeling av post 15'!D32)","v":""},{"$f":"+IF('Fordeling av post 15'!E32=\"\",\"\",'Fordeling av post 15'!E32)","v":""}]
[null,null,null,null,null,null,{"$f":"+IF('Fordeling av post 15'!B33=\"\",\"\",'Fordeling av post 15'!B33)","v":""},{"$f":"+IF('Fordeling av post 15'!C33=\"\",\"\",'Fordeling av post 15'!C33)","v":""},{"$f":"+IF('Fordeling av post 15'!D33=\"\",\"\",'Fordeling av post 15'!D33)","v":""},{"$f":"+IF('Fordeling av post 15'!E33=\"\",\"\",'Fordeling av post 15'!E33)","v":""}]
[null,null,null,null,null,null,{"$f":"+IF('Fordeling av post 15'!B34=\"\",\"\",'Fordeling av post 15'!B34)","v":""},{"$f":"+IF('Fordeling av post 15'!C34=\"\",\"\",'Fordeling av post 15'!C34)","v":""},{"$f":"+IF('Fordeling av post 15'!D34=\"\",\"\",'Fordeling av post 15'!D34)","v":""},{"$f":"+IF('Fordeling av post 15'!E34=\"\",\"\",'Fordeling av post 15'!E34)","v":""}]
[null,null,null,null,null,null,{"$f":"+IF('Fordeling av post 15'!B35=\"\",\"\",'Fordeling av post 15'!B35)","v":""},{"$f":"+IF('Fordeling av post 15'!C35=\"\",\"\",'Fordeling av post 15'!C35)","v":""},{"$f":"+IF('Fordeling av post 15'!D35=\"\",\"\",'Fordeling av post 15'!D35)","v":""},{"$f":"+IF('Fordeling av post 15'!E35=\"\",\"\",'Fordeling av post 15'!E35)","v":""}]
[null,null,null,null,null,null,{"$f":"+IF('Fordeling av post 15'!B36=\"\",\"\",'Fordeling av post 15'!B36)","v":""},{"$f":"+IF('Fordeling av post 15'!C36=\"\",\"\",'Fordeling av post 15'!C36)","v":""},{"$f":"+IF('Fordeling av post 15'!D36=\"\",\"\",'Fordeling av post 15'!D36)","v":""},{"$f":"+IF('Fordeling av post 15'!E36=\"\",\"\",'Fordeling av post 15'!E36)","v":""}]
[null,null,null,null,null,null,{"$f":"+IF('Fordeling av post 15'!B37=\"\",\"\",'Fordeling av post 15'!B37)","v":""},{"$f":"+IF('Fordeling av post 15'!C37=\"\",\"\",'Fordeling av post 15'!C37)","v":""},{"$f":"+IF('Fordeling av post 15'!D37=\"\",\"\",'Fordeling av post 15'!D37)","v":""},{"$f":"+IF('Fordeling av post 15'!E37=\"\",\"\",'Fordeling av post 15'!E37)","v":""}]
[null,null,null,null,null,null,{"$f":"+IF('Fordeling av post 15'!B38=\"\",\"\",'Fordeling av post 15'!B38)","v":""},{"$f":"+IF('Fordeling av post 15'!C38=\"\",\"\",'Fordeling av post 15'!C38)","v":""},{"$f":"+IF('Fordeling av post 15'!D38=\"\",\"\",'Fordeling av post 15'!D38)","v":""},{"$f":"+IF('Fordeling av post 15'!E38=\"\",\"\",'Fordeling av post 15'!E38)","v":""}]
[null,null,null,null,null,null,{"$f":"+IF('Fordeling av post 15'!B39=\"\",\"\",'Fordeling av post 15'!B39)","v":""},{"$f":"+IF('Fordeling av post 15'!C39=\"\",\"\",'Fordeling av post 15'!C39)","v":""},{"$f":"+IF('Fordeling av post 15'!D39=\"\",\"\",'Fordeling av post 15'!D39)","v":""},{"$f":"+IF('Fordeling av post 15'!E39=\"\",\"\",'Fordeling av post 15'!E39)","v":""}]
[null,null,null,null,null,null,{"$f":"+IF('Fordeling av post 15'!B40=\"\",\"\",'Fordeling av post 15'!B40)","v":""},{"$f":"+IF('Fordeling av post 15'!C40=\"\",\"\",'Fordeling av post 15'!C40)","v":""},{"$f":"+IF('Fordeling av post 15'!D40=\"\",\"\",'Fordeling av post 15'!D40)","v":""},{"$f":"+IF('Fordeling av post 15'!E40=\"\",\"\",'Fordeling av post 15'!E40)","v":""}]
[null,null,null,null,null,null,{"$f":"+IF('Fordeling av post 15'!B41=\"\",\"\",'Fordeling av post 15'!B41)","v":""},{"$f":"+IF('Fordeling av post 15'!C41=\"\",\"\",'Fordeling av post 15'!C41)","v":""},{"$f":"+IF('Fordeling av post 15'!D41=\"\",\"\",'Fordeling av post 15'!D41)","v":""},{"$f":"+IF('Fordeling av post 15'!E41=\"\",\"\",'Fordeling av post 15'!E41)","v":""}]
[null,null,null,null,null,null,{"$f":"+IF('Fordeling av post 15'!B42=\"\",\"\",'Fordeling av post 15'!B42)","v":""},{"$f":"+IF('Fordeling av post 15'!C42=\"\",\"\",'Fordeling av post 15'!C42)","v":""},{"$f":"+IF('Fordeling av post 15'!D42=\"\",\"\",'Fordeling av post 15'!D42)","v":""},{"$f":"+IF('Fordeling av post 15'!E42=\"\",\"\",'Fordeling av post 15'!E42)","v":""}]
[null,null,null,null,null,null,{"$f":"+IF('Fordeling av post 15'!B43=\"\",\"\",'Fordeling av post 15'!B43)","v":""},{"$f":"+IF('Fordeling av post 15'!C43=\"\",\"\",'Fordeling av post 15'!C43)","v":""},{"$f":"+IF('Fordeling av post 15'!D43=\"\",\"\",'Fordeling av post 15'!D43)","v":""},{"$f":"+IF('Fordeling av post 15'!E43=\"\",\"\",'Fordeling av post 15'!E43)","v":""}]
[null,null,null,null,null,null,{"$f":"+IF('Fordeling av post 15'!B44=\"\",\"\",'Fordeling av post 15'!B44)","v":""},{"$f":"+IF('Fordeling av post 15'!C44=\"\",\"\",'Fordeling av post 15'!C44)","v":""},{"$f":"+IF('Fordeling av post 15'!D44=\"\",\"\",'Fordeling av post 15'!D44)","v":""},{"$f":"+IF('Fordeling av post 15'!E44=\"\",\"\",'Fordeling av post 15'!E44)","v":""}]
[null,null,null,null,null,null,{"$f":"+IF('Fordeling av post 15'!B45=\"\",\"\",'Fordeling av post 15'!B45)","v":""},{"$f":"+IF('Fordeling av post 15'!C45=\"\",\"\",'Fordeling av post 15'!C45)","v":""},{"$f":"+IF('Fordeling av post 15'!D45=\"\",\"\",'Fordeling av post 15'!D45)","v":""},{"$f":"+IF('Fordeling av post 15'!E45=\"\",\"\",'Fordeling av post 15'!E45)","v":""}]
[null,null,null,null,null,null,{"$f":"+IF('Fordeling av post 15'!B46=\"\",\"\",'Fordeling av post 15'!B46)","v":""},{"$f":"+IF('Fordeling av post 15'!C46=\"\",\"\",'Fordeling av post 15'!C46)","v":""},{"$f":"+IF('Fordeling av post 15'!D46=\"\",\"\",'Fordeling av post 15'!D46)","v":""},{"$f":"+IF('Fordeling av post 15'!E46=\"\",\"\",'Fordeling av post 15'!E46)","v":""}]
[null,null,null,null,null,null,{"$f":"+IF('Fordeling av post 15'!B47=\"\",\"\",'Fordeling av post 15'!B47)","v":""},{"$f":"+IF('Fordeling av post 15'!C47=\"\",\"\",'Fordeling av post 15'!C47)","v":""},{"$f":"+IF('Fordeling av post 15'!D47=\"\",\"\",'Fordeling av post 15'!D47)","v":""},{"$f":"+IF('Fordeling av post 15'!E47=\"\",\"\",'Fordeling av post 15'!E47)","v":""}]
[null,null,null,null,null,null,{"$f":"+IF('Fordeling av post 15'!B48=\"\",\"\",'Fordeling av post 15'!B48)","v":""},{"$f":"+IF('Fordeling av post 15'!C48=\"\",\"\",'Fordeling av post 15'!C48)","v":""},{"$f":"+IF('Fordeling av post 15'!D48=\"\",\"\",'Fordeling av post 15'!D48)","v":""},{"$f":"+IF('Fordeling av post 15'!E48=\"\",\"\",'Fordeling av post 15'!E48)","v":""}]

{"sheet":"nfl_03","index":6,"n_rows":33,"n_cols":9,"rows_kept":33,"cut":false,"hidden":true,"merged":[[21,3,32,3],[21,4,21,5],[22,4,26,4],[27,4,27,5],[28,4,32,4],[6,7,6,8],[9,3,20,3],[9,4,9,5],[10,4,14,4],[15,4,15,5],[16,4,20,4]]}
[null,null,null,"nfl_03. Brutto utlån og misligholdte engasjementer - Norge, fordelt på låntakers alder"]
[]
[]
[]
[]
[]
[null,null,null,{"$f":"IF([1]Forside!G12=\"4. kvartal\",\"\",\"SKAL IKKE RAPPORTERES FOR DENNE PERIODEN\")","v":"SKAL IKKE RAPPORTERES FOR DENNE PERIODEN"},null,null,null,"Beløp (mill.kr)"]
[null,null,null,null,null,null,null,{"$f":"nfl_01!H8","v":"pr. 31.03.2025"},{"$f":"nfl_01!I8","v":"pr. 31.03.2024"}]
[null,null,null,null,null,null,"Code","0010","0020"]
[null,"ccr_12","7.3","Brutto utlån kunder - Norge","Kredittkort",null,"0010",{"$f":"IF(VLOOKUP(B10,Årlig!$A:$E,4,0)=\"\",\"\",VLOOKUP(B10,Årlig!$A:$E,4,0))","v":""},{"$f":"IF(VLOOKUP(B10,Årlig!$A:$E,5,0)=\"\",\"\",VLOOKUP(B10,Årlig!$A:$E,5,0))","v":""}]
[null,"ccr_44","18.1",null,"Kredittkort","18-29 år","0020",{"$f":"IF(VLOOKUP(B11,Årlig!$A:$E,4,0)=\"\",\"\",VLOOKUP(B11,Årlig!$A:$E,4,0))","v":""},{"$f":"IF(VLOOKUP(B11,Årlig!$A:$E,5,0)=\"\",\"\",VLOOKUP(B11,Årlig!$A:$E,5,0))","v":""}]
[null,"ccr_45","18.2",null,null,"30-39 år","0030",{"$f":"IF(VLOOKUP(B12,Årlig!$A:$E,4,0)=\"\",\"\",VLOOKUP(B12,Årlig!$A:$E,4,0))","v":""},{"$f":"IF(VLOOKUP(B12,Årlig!$A:$E,5,0)=\"\",\"\",VLOOKUP(B12,Årlig!$A:$E,5,0))","v":""}]
[null,"ccr_46","18.3",null,null,"40-49 år","0040",{"$f":"IF(VLOOKUP(B13,Årlig!$A:$E,4,0)=\"\",\"\",VLOOKUP(B13,Årlig!$A:$E,4,0))","v":""},{"$f":"IF(VLOOKUP(B13,Årlig!$A:$E,5,0)=\"\",\"\",VLOOKUP(B13,Årlig!$A:$E,5,0))","v":""}]
[null,"ccr_47","18.4",null,null,"50-59 år","0050",{"$f":"IF(VLOOKUP(B14,Årlig!$A:$E,4,0)=\"\",\"\",VLOOKUP(B14,Årlig!$A:$E,4,0))","v":""},{"$f":"IF(VLOOKUP(B14,Årlig!$A:$E,5,0)=\"\",\"\",VLOOKUP(B14,Årlig!$A:$E,5,0))","v":""}]
[null,"ccr_48","18.5",null,null,"60 år +","0060",{"$f":"IF(VLOOKUP(B15,Årlig!$A:$E,4,0)=\"\",\"\",VLOOKUP(B15,Årlig!$A:$E,4,0))","v":""},{"$f":"IF(VLOOKUP(B15,Årlig!$A:$E,5,0)=\"\",\"\",VLOOKUP(B15,Årlig!$A:$E,5,0))","v":""}]
[null,"ccr_15","7.7",null,"Andre forbrukslån",null,"0070",{"$f":"IF(VLOOKUP(B16,Årlig!$A:$E,4,0)=\"\",\"\",VLOOKUP(B16,Årlig!$A:$E,4,0))","v":""},{"$f":"IF(VLOOKUP(B16,Årlig!$A:$E,5,0)=\"\",\"\",VLOOKUP(B16,Årlig!$A:$E,5,0))","v":""}]
[null,"ccr_50","18.1",null,"Andre forbrukslån","18-29 år","0080",{"$f":"IF(VLOOKUP(B17,Årlig!$A:$E,4,0)=\"\",\"\",VLOOKUP(B17,Årlig!$A:$E,4,0))","v":""},{"$f":"IF(VLOOKUP(B17,Årlig!$A:$E,5,0)=\"\",\"\",VLOOKUP(B17,Årlig!$A:$E,5,0))","v":""}]
[null,"ccr_51","18.2",null,null,"30-39 år","0090",{"$f":"IF(VLOOKUP(B18,Årlig!$A:$E,4,0)=\"\",\"\",VLOOKUP(B18,Årlig!$A:$E,4,0))","v":""},{"$f":"IF(VLOOKUP(B18,Årlig!$A:$E,5,0)=\"\",\"\",VLOOKUP(B18,Årlig!$A:$E,5,0))","v":""}]
[null,"ccr_52","18.3",null,null,"40-49 år","0100",{"$f":"IF(VLOOKUP(B19,Årlig!$A:$E,4,0)=\"\",\"\",VLOOKUP(B19,Årlig!$A:$E,4,0))","v":""},{"$f":"IF(VLOOKUP(B19,Årlig!$A:$E,5,0)=\"\",\"\",VLOOKUP(B19,Årlig!$A:$E,5,0))","v":""}]
[null,"ccr_53","18.4",null,null,"50-59 år","0110",{"$f":"IF(VLOOKUP(B20,Årlig!$A:$E,4,0)=\"\",\"\",VLOOKUP(B20,Årlig!$A:$E,4,0))","v":""},{"$f":"IF(VLOOKUP(B20,Årlig!$A:$E,5,0)=\"\",\"\",VLOOKUP(B20,Årlig!$A:$E,5,0))","v":""}]
[null,"ccr_54","18.5",null,null,"60 år +","0120",{"$f":"IF(VLOOKUP(B21,Årlig!$A:$E,4,0)=\"\",\"\",VLOOKUP(B21,Årlig!$A:$E,4,0))","v":""},{"$f":"IF(VLOOKUP(B21,Årlig!$A:$E,5,0)=\"\",\"\",VLOOKUP(B21,Årlig!$A:$E,5,0))","v":""}]
[null,"ccr_19","8.3","Brutto misligholdte engasjementer, 90 dager 1) - Norge","Kredittkort",null,"0130",{"$f":"IF(VLOOKUP(B22,Årlig!$A:$E,4,0)=\"\",\"\",VLOOKUP(B22,Årlig!$A:$E,4,0))","v":""},{"$f":"IF(VLOOKUP(B22,Årlig!$A:$E,5,0)=\"\",\"\",VLOOKUP(B22,Årlig!$A:$E,5,0))","v":""}]
[null,"ccr_56","19.1",null,"Kredittkort","18-29 år","0140",{"$f":"IF(VLOOKUP(B23,Årlig!$A:$E,4,0)=\"\",\"\",VLOOKUP(B23,Årlig!$A:$E,4,0))","v":""},{"$f":"IF(VLOOKUP(B23,Årlig!$A:$E,5,0)=\"\",\"\",VLOOKUP(B23,Årlig!$A:$E,5,0))","v":""}]
[null,"ccr_57","19.2",null,null,"30-39 år","0150",{"$f":"IF(VLOOKUP(B24,Årlig!$A:$E,4,0)=\"\",\"\",VLOOKUP(B24,Årlig!$A:$E,4,0))","v":""},{"$f":"IF(VLOOKUP(B24,Årlig!$A:$E,5,0)=\"\",\"\",VLOOKUP(B24,Årlig!$A:$E,5,0))","v":""}]
[null,"ccr_58","19.3",null,null,"40-49 år","0160",{"$f":"IF(VLOOKUP(B25,Årlig!$A:$E,4,0)=\"\",\"\",VLOOKUP(B25,Årlig!$A:$E,4,0))","v":""},{"$f":"IF(VLOOKUP(B25,Årlig!$A:$E,5,0)=\"\",\"\",VLOOKUP(B25,Årlig!$A:$E,5,0))","v":""}]
[null,"ccr_59","19.4",null,null,"50-59 år","0170",{"$f":"IF(VLOOKUP(B26,Årlig!$A:$E,4,0)=\"\",\"\",VLOOKUP(B26,Årlig!$A:$E,4,0))","v":""},{"$f":"IF(VLOOKUP(B26,Årlig!$A:$E,5,0)=\"\",\"\",VLOOKUP(B26,Årlig!$A:$E,5,0))","v":""}]
[null,"ccr_60","19.5",null,null,"60 år +","0180",{"$f":"IF(VLOOKUP(B27,Årlig!$A:$E,4,0)=\"\",\"\",VLOOKUP(B27,Årlig!$A:$E,4,0))","v":""},{"$f":"IF(VLOOKUP(B27,Årlig!$A:$E,5,0)=\"\",\"\",VLOOKUP(B27,Årlig!$A:$E,5,0))","v":""}]
[null,"ccr_21","8.5",null,"Andre forbrukslån",null,"0190",{"$f":"IF(VLOOKUP(B28,Årlig!$A:$E,4,0)=\"\",\"\",VLOOKUP(B28,Årlig!$A:$E,4,0))","v":""},{"$f":"IF(VLOOKUP(B28,Årlig!$A:$E,5,0)=\"\",\"\",VLOOKUP(B28,Årlig!$A:$E,5,0))","v":""}]
[null,"ccr_62","19.1",null,"Andre forbrukslån","18-29 år","0200",{"$f":"IF(VLOOKUP(B29,Årlig!$A:$E,4,0)=\"\",\"\",VLOOKUP(B29,Årlig!$A:$E,4,0))","v":""},{"$f":"IF(VLOOKUP(B29,Årlig!$A:$E,5,0)=\"\",\"\",VLOOKUP(B29,Årlig!$A:$E,5,0))","v":""}]
[null,"ccr_63","19.2",null,null,"30-39 år","0210",{"$f":"IF(VLOOKUP(B30,Årlig!$A:$E,4,0)=\"\",\"\",VLOOKUP(B30,Årlig!$A:$E,4,0))","v":""},{"$f":"IF(VLOOKUP(B30,Årlig!$A:$E,5,0)=\"\",\"\",VLOOKUP(B30,Årlig!$A:$E,5,0))","v":""}]
[null,"ccr_64","19.3",null,null,"40-49 år","0220",{"$f":"IF(VLOOKUP(B31,Årlig!$A:$E,4,0)=\"\",\"\",VLOOKUP(B31,Årlig!$A:$E,4,0))","v":""},{"$f":"IF(VLOOKUP(B31,Årlig!$A:$E,5,0)=\"\",\"\",VLOOKUP(B31,Årlig!$A:$E,5,0))","v":""}]
[null,"ccr_65","19.4",null,null,"50-59 år","0230",{"$f":"IF(VLOOKUP(B32,Årlig!$A:$E,4,0)=\"\",\"\",VLOOKUP(B32,Årlig!$A:$E,4,0))","v":""},{"$f":"IF(VLOOKUP(B32,Årlig!$A:$E,5,0)=\"\",\"\",VLOOKUP(B32,Årlig!$A:$E,5,0))","v":""}]
[null,"ccr_66","19.5",null,null,"60 år +","0240",{"$f":"IF(VLOOKUP(B33,Årlig!$A:$E,4,0)=\"\",\"\",VLOOKUP(B33,Årlig!$A:$E,4,0))","v":""},{"$f":"IF(VLOOKUP(B33,Årlig!$A:$E,5,0)=\"\",\"\",VLOOKUP(B33,Årlig!$A:$E,5,0))","v":""}]

{"sheet":"nfl_04","index":7,"n_rows":15,"n_cols":9,"rows_kept":15,"cut":false,"hidden":true,"merged":[[6,7,6,8],[9,4,9,5],[10,4,11,4],[12,4,12,5],[13,4,14,4]]}
[null,null,null,null,"nfl_04. Lånesøknader (årlig)"]
[]
[]
[]
[]
[]
[null,null,null,null,{"$f":"IF([1]Forside!G12=\"4. kvartal\",\"\",\"SKAL IKKE RAPPORTERES FOR DENNE PERIODEN\")","v":"SKAL IKKE RAPPORTERES FOR DENNE PERIODEN"},null,null,"Antall"]
[null,null,null,null,null,null,null,{"$f":"nfl_01!H8","v":"pr. 31.03.2025"},{"$f":"nfl_01!I8","v":"pr. 31.03.2024"}]
[null,null,null,null,null,null,"Code","0010","0020"]
[null,null,"ccr_38","16.","Lånesøknader til behandling",null,"0010",{"$f":"IF(VLOOKUP(C10,Årlig!$A:$E,4,0)=\"\",\"\",VLOOKUP(C10,Årlig!$A:$E,4,0))","v":""},{"$f":"IF(VLOOKUP(C10,Årlig!$A:$E,5,0)=\"\",\"\",VLOOKUP(C10,Årlig!$A:$E,5,0))","v":""}]
[null,null,"ccr_39","16.1","Lånesøknader til behandling","kredittkort","0020",{"$f":"IF(VLOOKUP(C11,Årlig!$A:$E,4,0)=\"\",\"\",VLOOKUP(C11,Årlig!$A:$E,4,0))","v":""},{"$f":"IF(VLOOKUP(C11,Årlig!$A:$E,5,0)=\"\",\"\",VLOOKUP(C11,Årlig!$A:$E,5,0))","v":""}]
[null,null,"ccr_40","16.2",null,"andre forbrukslån","0030",{"$f":"IF(VLOOKUP(C12,Årlig!$A:$E,4,0)=\"\",\"\",VLOOKUP(C12,Årlig!$A:$E,4,0))","v":""},{"$f":"IF(VLOOKUP(C12,Årlig!$A:$E,5,0)=\"\",\"\",VLOOKUP(C12,Årlig!$A:$E,5,0))","v":""}]
[null,null,"ccr_41","17.","Avslåtte lånesøknader ",null,"0040",{"$f":"IF(VLOOKUP(C13,Årlig!$A:$E,4,0)=\"\",\"\",VLOOKUP(C13,Årlig!$A:$E,4,0))","v":""},{"$f":"IF(VLOOKUP(C13,Årlig!$A:$E,5,0)=\"\",\"\",VLOOKUP(C13,Årlig!$A:$E,5,0))","v":""}]
[null,null,"ccr_42","17.1","Avslåtte lånesøknader ","kredittkort","0050",{"$f":"IF(VLOOKUP(C14,Årlig!$A:$E,4,0)=\"\",\"\",VLOOKUP(C14,Årlig!$A:$E,4,0))","v":""},{"$f":"IF(VLOOKUP(C14,Årlig!$A:$E,5,0)=\"\",\"\",VLOOKUP(C14,Årlig!$A:$E,5,0))","v":""}]
[null,null,"ccr_43","17.2",null,"andre forbrukslån","0060",{"$f":"IF(VLOOKUP(C15,Årlig!$A:$E,4,0)=\"\",\"\",VLOOKUP(C15,Årlig!$A:$E,4,0))","v":""},{"$f":"IF(VLOOKUP(C15,Årlig!$A:$E,5,0)=\"\",\"\",VLOOKUP(C15,Årlig!$A:$E,5,0))","v":""}]

{"sheet":"global","index":8,"n_rows":8,"n_cols":3,"rows_kept":8,"cut":false,"hidden":true,"merged":[]}
["Name","Key","Value"]
["Excel versjonsnummer (mottaksløsning)","dwh_excel_version",{"$f":"+Forside!$A$2","v":293}]
["Workbook version","workbook_version",1]
["Workbook code","workbook_code","nfl"]
["KRT number","krt_number",{"$f":"+Forside!$C$1","v":"KRT-1133"}]
["Identifier","identifier",{"$f":"+Forside!$G$10","v":0}]
["Reporting period","reporting_period",{"$f":"+Forside!$D$12","v":"31.03.2025"}]
["Consolidation level","consolidaton_level","Ikke konsolidert"]