{"text_format":"1","workbook":"xlsx","n_sheets":9,"sheets":["Forside","Kvartal","Årlig","Fordeling av post 15","nfl_01","nfl_02","nfl_03","nfl_04","global"],"not_rendered":{"charts":0,"images":1,"macros":1,"external_links":1,"defined_names":4,"comments":0,"pivot_tables":0},"unopened":[],"bounds":{"document_bytes":16777216,"sheet_cells":100000,"rows_first":2000,"rows_last":500,"rows_between":2000,"halvings":0,"cell_chars":16384,"cell_head_chars":4096},"cells_cut":0,"cells_raw":0,"read":"whole","date_system":"1900"}

{"sheet":"Forside","index":0,"n_rows":13,"n_cols":98,"rows_kept":13,"cut":false,"hidden":false,"merged":[[12,4,12,5],[12,1,12,2],[11,1,11,2],[11,3,11,4],[6,1,6,7],[7,2,7,6],[8,1,8,5],[9,1,9,5],[10,1,10,2],[10,3,10,4]]}
["Versjonsnummer",null,"KRT-1133",null,null,null,null,null,null,null,null,null,null,null,null,null,null,null,null,{"$f":"YEAR(NOW())-1","v":2024},1,{"$f":"DATE(T1,U2+1,0)","v":"2024-02-29"},null,null,1,null,{"$f":"D12","v":"31.03.2025"},"pr.",null,null,null,null,null,null,null,null,null,null,null,null,null,null,null,null,null,null,null,null,null,null,null,null,{"$f":"C1","v":"KRT-1133"},{"$f":"B12","v":20230331},{"$f":"A2","v":293},{"$f":"G10","v":0},{"$f":"F12","v":2025},{"$f":"IF(G12=\"1.kvartal\",CONCATENATE(\"3\"),IF(G12=\"1.halvår\",CONCATENATE(\"6\"),IF(G12=\"1.-3.kvartal\",CONCATENATE(\"9\"),IF(G12=\"År\",CONCATENATE(\"12\"),\"\"))))","v":"3"},10,"Forside",{"$f":"IF(G13=\"Konsolidert\",2,IF(G13=\"Ikke Konsolidert\",1,IF(G13=\"\",-1)))","v":-1},0,null,null,null,null,null,null,null,null,null,null,null,null,null,null,null,null,"BA",999999001,"BB",{"$f":"+CB1+1","v":999999002},"BC",{"$f":"+CD1+1","v":999999003},"BD",{"$f":"+CF1+1","v":999999004},"BE",{"$f":"+CH1+1","v":999999005},"BF",{"$f":"+CJ1+1","v":999999006},"BG",{"$f":"+CL1+1","v":999999007},"BH",{"$f":"+CN1+1","v":999999008},"BI",{"$f":"+CP1+1","v":999999009},"BJ",{"$f":"+CR1+1","v":999999010}]
[293,null,null,null,null,null,null,null,null,null,null,null,null,null,null,null,null,null,null,{"$f":"YEAR(NOW())","v":2025},2,{"$f":"DAY(V1)","v":29},null,null,2,null,{"$f":"CONCATENATE(LEFT(AA1,6),CONCATENATE(RIGHT(T1,4)))","v":"31.03.2024"},null,null,null,null,null,null,null,null,null,null,null,null,null,null,null,null,null,null,null,null,null,null,null,null,null,"Skjema-ID","Gyldig Excel Mal","VersjonsNr","Orgnr","År","MND","Antall datakolonner","Arknavn","Kons./ikke kons.","SA/IRB"]
[null,null,null,null,null,null,null,null,null,null,null,null,null,null,null,null,null,null,null,null,3,null,null,null,3,null,"brukes i arkfane nfl_01",null,null,null,null,null,null,null,null,null,null,null,null,null,null,null,null,null,null,null,null,null,null,null,null,null,null,null,null,null,null,null,"i dokumentet"]
[null,null,null,null,null,null,null,null,null,null,null,null,null,null,null,null,null,null,null,null,4,null,null,null,4]
[null,null,null,null,null,null,null,null,null,null,null,null,null,null,null,null,null,null,null,null,5,null,null,null,5]
[null,null,null,null,null,null,null,null,null,null,null,null,null,null,null,null,null,null,null,null,6,null,null,null,6]
[null,"Skjema for rapportering av forbrukslån  (Lån uten sikkerhet til personkunder) ",null,null,null,null,null,null,null,null,null,null,null,null,null,null,null,null,null,null,7,null,null,null,7]
[null,null,null,null,null,null,null,null,null,null,null,null,null,null,null,null,null,null,null,null,8,null,null,null,8]
[null,"FORETAKETS NAVN:",null,null,null,null,"ORGANISASJONS-\nNUMMER:",null,null,null,null,null,null,null,null,null,null,null,null,null,9,null,null,null,9]
[null,null,null,null,null,null,null,null,null,null,null,null,null,null,null,null,null,null,null,null,10,null,null,null,10]
[null,"EXCELMAL GYLDIG FRA:",null,"SISTE DAG I \nRAPPORTERINGSPERIODEN:",null,"RAPPORTERINGSÅR:","RAPPORTERINGSPERIODE:",null,null,null,null,null,null,null,null,null,null,null,null,null,11]
[null,20230331,null,{"$f":"IF(G12=\"1.kvartal\",CONCATENATE(\"31.03.\",CONCATENATE(RIGHT(F12,4))),IF(G12=\"1.halvår\",CONCATENATE(\"30.06.\",CONCATENATE(RIGHT(F12,4))),IF(G12=\"1.-3.kvartal\",CONCATENATE(\"30.09.\",CONCATENATE(RIGHT(F12,4))),IF(G12=\"År\",CONCATENATE(\"31.12.\",CONCATENATE(RIGHT(F12,4)))))))","v":"31.03.2025"},null,2025,"1.kvartal",null,null,null,null,null,null,null,null,null,null,null,null,null,12]
[null,null,null,null,null,null,null,{"$f":"IF(G13=\"Ja\",1,\"\")","v":""}]

{"sheet":"Kvartal","index":1,"n_rows":59,"n_cols":8,"rows_kept":59,"cut":false,"hidden":false,"merged":[[0,2,2,4]]}
[null,null,"Skjema for rapportering av forbrukslån  (Lån uten sikkerhet til personkunder) "]
[]
[]
[]
[null,null,{"$f":"Forside!B10","v":0}]
[null,null,"Del 1: Regnskapstall forbrukslån",{"$f":"Forside!$G$12 &\" \" &Forside!F12","v":"1.kvartal 2025"},{"$f":"Forside!$G$12 &\" \" &Forside!F12-1","v":"1.kvartal 2024"}]
[null,null,null,"mill. kr","mill. kr"]
["ccr_1","1.","Renteinntekter"]
["ccr_2","2.","Rentekostnader",null,null,null,null,{"$f":"IF(D9<0,\"Post 2 skal føres med positivt fortegn\",IF(E9<0,\"Post 2 skal føres med positivt fortegn\",\"\"))","v":""}]
["ccr_3","3.","Netto renteinntekter (1 - 2)",null,null,null,null,{"$f":"IF(ISBLANK(D10),\"Post 3 må fylles ut\",IF(ISBLANK(E10),\"Post 3 må fylles ut\",\"\"))","v":"Post 3 må fylles ut"}]
["ccr_4","4.","Tap på utlån (4.1 + 4.2)"]
["ccr_5","4.1","Tap kredittkort"]
["ccr_6","4.2","Tap andre forbrukslån"]
["ccr_7",5,"Resultat av ordinær drift før skatt",null,null,null,null,{"$f":"IF(ISBLANK(D14),\"Post 5 må fylles ut\",IF(ISBLANK(E14),\"Post 5 må fylles ut\",\"\"))","v":"Post 5 må fylles ut"}]
[]
["ccr_8","6.","Gjennomsnittlig forvaltningskapital",null,null,null,null,{"$f":"IF(ISBLANK(D16),\"Post 6 må fylles ut\",IF(ISBLANK(E16),\"Post 6 må fylles ut\",\"\"))","v":"Post 6 må fylles ut"}]
[null,null,null,{"$f":"Forside!D12","v":"31.03.2025"},{"$f":"CONCATENATE(LEFT(D17,6),CONCATENATE(RIGHT(E6,4)))","v":"31.03.2024"}]
[null,null,null,"mill. kr","mill. kr"]
["ccr_9","7.","Brutto utlån kunder (7.2 + 7.6) ",null,null,{"$f":"D21+D25","v":0},{"$f":"E21+E25","v":0},{"$f":"IF(OR(ROUND(D19,0)<>ROUND(F19,0),ROUND(E19,0)<>ROUND(G19,0)),\"Må fylles ut! Er lik 7.2+7.6\",\"\")","v":""}]
["ccr_10","7.1","    Herav Norge (7.3 + 7.7)",null,null,{"$f":"D22+D26","v":0},{"$f":"E22+E26","v":0},{"$f":"IF(OR(ROUND(D20,0)<>ROUND(F20,0),ROUND(E20,0)<>ROUND(G20,0)),\"Brutto utlån kunder avviker fra summen av postene 7.3+7.7\",\"\")","v":""}]
{"$rows_left_out":40}
{"sheet":"Årlig","index":2,"n_rows":103,"n_cols":8,"rows_kept":103,"cut":false,"hidden":true,"merged":[[0,2,2,4]]}
[null,null,"Skjema for rapportering av forbrukslån  (Lån uten sikkerhet til personkunder) "]
[]
[]
[]
[null,null,{"$f":"Forside!B10","v":0}]
[null,null,"Del 1: Regnskapstall forbrukslån",{"$f":"Forside!$F$12","v":2025},{"$f":"Forside!$F$12-1","v":2024}]
[null,null,null,"mill. kr","mill. kr"]
["ccr_1","1.","Renteinntekter"]
["ccr_2","2.","Rentekostnader",null,null,null,null,{"$f":"IF(D9 < 0,\"Post 2 skal føres med positivt fortegn\",IF(E9<0,\"Post 2 skal føres med positivt fortegn \",\"\"))","v":""}]
["ccr_3","3.","Netto renteinntekter (1 - 2)",null,null,null,null,{"$f":"IF(ISBLANK(D10),\"Post 3 må fylles ut\",IF(ISBLANK(E10),\"Post 3 må fylles ut\",\"\"))","v":"Post 3 må fylles ut"}]
["ccr_4","4.","Tap på utlån (4.1 + 4.2)"]
["ccr_5","4.1","Tap kredittkort"]
["ccr_6","4.2","Tap andre forbrukslån"]
["ccr_7",5,"Resultat av ordinær drift før skatt",null,null,null,null,{"$f":"IF(ISBLANK(D14),\"Post 5 må fylles ut\",IF(ISBLANK(E14),\"Post 5 må fylles ut\",\"\"))","v":"Post 5 må fylles ut"}]
[]
["ccr_8","6.","Gjennomsnittlig forvaltningskapital",null,null,null,null,{"$f":"IF(ISBLANK(D16),\"Post 6 må fylles ut\",IF(ISBLANK(E16),\"Post 6 må fylles ut\",\"\"))","v":"Post 6 må fylles ut"}]
[null,null,null,{"$f":"Forside!D12","v":"31.03.2025"},{"$f":"CONCATENATE(LEFT(D17,6),CONCATENATE(RIGHT(E6,4)))","v":"31.03.2024"}]
[null,null,null,"mill. kr","mill. kr"]
["ccr_9","7.","Brutto utlån kunder (7.2 + 7.6) ",null,null,{"$f":"D21+D25","v":0},{"$f":"E21+E25","v":0},{"$f":"IF(OR(ROUND(D19,0)<>ROUND(F19,0),ROUND(E19,0)<>ROUND(G19,0)),\"Må fylles ut! Er lik 7.2+7.6\",\"\")","v":""}]
["ccr_10","7.1","    Herav Norge (7.3 + 7.6)",null,null,{"$f":"D22+D26","v":0},{"$f":"E22+E26","v":0},{"$f":"IF(OR(ROUND(D20,0)<>ROUND(F20,0),ROUND(E20,0)<>ROUND(G20,0)),\"Brutto utlån kunder avviker fra summen av postene 7.3+7.7\",\"\")","v":""}]
{"$rows_left_out":84}
{"sheet":"Fordeling av post 15","index":3,"n_rows":7,"n_cols":5,"rows_kept":7,"cut":false,"hidden":false,"merged":[[5,1,6,1],[5,2,6,2]]}
[]
[null,"Skjema for rapportering av forbrukslån  (Lån uten sikkerhet til personkunder) "]
[]
[null,"Fordeling av post 15 på enkeltforetak:"]
[null,{"$f":"Forside!B10","v":0}]
[null,"Organisajonsnummer  Bruk LEI-kode hvis ikke org.nr.","Fullstendig navn på foretak som portefølje er solgt til:",{"$f":"IF(Forside!G12=\"År\",Forside!F12, Forside!G12&\" \"&Forside!F12)","v":"1.kvartal 2025"},{"$f":"IF(Forside!G12=\"År\",Forside!F12-1, Forside!G12&\" \"&Forside!F12-1)","v":"1.kvartal 2024"}]
[null,null,null,"mill. kr","mill. kr"]

{"sheet":"nfl_01","index":4,"n_rows":46,"n_cols":9,"rows_kept":46,"cut":false,"hidden":true,"merged":[[40,2,44,2],[40,3,40,5],[41,4,41,5],[42,3,43,3],[42,4,42,5],[43,4,43,5],[44,3,44,5],[37,2,39,2],[37,3,37,5],[38,3,38,5],[39,3,39,5],[29,2,29,5],[30,2,34,2],[30,3,30,5],[31,3,31,5],[32,4,32,5],[33,3,33,5],[34,4,34,5],[35,2,36,2],[35,3,35,5],[36,3,36,5],[6,7,6,8],[9,2,9,5],[10,2,10,5],[11,2,11,5],[12,2,12,5],[13,2,14,2],[13,3,13,5],[14,3,14,5],[15,2,15,5],[16,2,16,5],[17,2,17,5],[18,3,22,3],[18,4,18,5],[19,4,19,5],[20,4,20,5],[21,4,21,5],[22,4,22,5],[28,4,28,5],[18,2,28,2],[23,3,23,5],[24,3,26,3],[24,4,24,5],[25,4,25,5],[27,3,27,5]]}
[null,null,"nfl_01. Regnskapstall forbrukslån"]
[]
[]
[]
[]
[]
[null,null,null,null,null,null,null,"Beløp (mill.kr)"]
[null,null,null,null,null,null,null,{"$f":"Forside!AB1&\" \" & Forside!AA1","v":"pr. 31.03.2025"},{"$f":"Forside!AB1& \" \" &Forside!AA2","v":"pr. 31.03.2024"}]
[null,null,null,null,null,null,"Code","0010","0020"]
["ccr_1","1.","Renteinntekter",null,null,null,"0010",{"$f":"IF(MONTH(Forside!$D$12)=12,IF(VLOOKUP(A10,Årlig!$A:$E,4,0)=\"\",\"\",VLOOKUP(A10,Årlig!$A:$E,4,0)),IF(VLOOKUP(A10,Kvartal!$A:$E,4,0)=\"\",\"\",VLOOKUP(A10,Kvartal!$A:$E,4,0)))","v":""},{"$f":"IF(MONTH(Forside!$D$12)=12,IF(VLOOKUP(A10,Årlig!$A:$E,5,0)=\"\",\"\",VLOOKUP(A10,Årlig!$A:$E,5,0)),IF(VLOOKUP(A10,Kvartal!$A:$E,5,0)=\"\",\"\",VLOOKUP(A10,Kvartal!$A:$E,5,0)))","v":""}]
["ccr_2","2.","Rentekostnader",null,null,null,"0020",{"$f":"IF(MONTH(Forside!$D$12)=12,IF(VLOOKUP(A11,Årlig!$A:$E,4,0)=\"\",\"\",VLOOKUP(A11,Årlig!$A:$E,4,0)),IF(VLOOKUP(A11,Kvartal!$A:$E,4,0)=\"\",\"\",VLOOKUP(A11,Kvartal!$A:$E,4,0)))","v":""},{"$f":"IF(MONTH(Forside!$D$12)=12,IF(VLOOKUP(A11,Årlig!$A:$E,5,0)=\"\",\"\",VLOOKUP(A11,Årlig!$A:$E,5,0)),IF(VLOOKUP(A11,Kvartal!$A:$E,5,0)=\"\",\"\",VLOOKUP(A11,Kvartal!$A:$E,5,0)))","v":""}]
["ccr_3","3.","Netto renteinntekter (Code 0010 - Code 0020)",null,null,null,"0030",{"$f":"IF(MONTH(Forside!$D$12)=12,IF(VLOOKUP(A12,Årlig!$A:$E,4,0)=\"\",\"\",VLOOKUP(A12,Årlig!$A:$E,4,0)),IF(VLOOKUP(A12,Kvartal!$A:$E,4,0)=\"\",\"\",VLOOKUP(A12,Kvartal!$A:$E,4,0)))","v":""},{"$f":"IF(MONTH(Forside!$D$12)=12,IF(VLOOKUP(A12,Årlig!$A:$E,5,0)=\"\",\"\",VLOOKUP(A12,Årlig!$A:$E,5,0)),IF(VLOOKUP(A12,Kvartal!$A:$E,5,0)=\"\",\"\",VLOOKUP(A12,Kvartal!$A:$E,5,0)))","v":""}]
["ccr_4","4.","Tap på utlån (Code 0050 + Code 0060)",null,null,null,"0040",{"$f":"IF(MONTH(Forside!$D$12)=12,IF(VLOOKUP(A13,Årlig!$A:$E,4,0)=\"\",\"\",VLOOKUP(A13,Årlig!$A:$E,4,0)),IF(VLOOKUP(A13,Kvartal!$A:$E,4,0)=\"\",\"\",VLOOKUP(A13,Kvartal!$A:$E,4,0)))","v":""},{"$f":"IF(MONTH(Forside!$D$12)=12,IF(VLOOKUP(A13,Årlig!$A:$E,5,0)=\"\",\"\",VLOOKUP(A13,Årlig!$A:$E,5,0)),IF(VLOOKUP(A13,Kvartal!$A:$E,5,0)=\"\",\"\",VLOOKUP(A13,Kvartal!$A:$E,5,0)))","v":""}]
["ccr_5","4.1","Tap på utlån","Kredittkort",null,null,"0050",{"$f":"IF(MONTH(Forside!$D$12)=12,IF(VLOOKUP(A14,Årlig!$A:$E,4,0)=\"\",\"\",VLOOKUP(A14,Årlig!$A:$E,4,0)),IF(VLOOKUP(A14,Kvartal!$A:$E,4,0)=\"\",\"\",VLOOKUP(A14,Kvartal!$A:$E,4,0)))","v":""},{"$f":"IF(MONTH(Forside!$D$12)=12,IF(VLOOKUP(A14,Årlig!$A:$E,5,0)=\"\",\"\",VLOOKUP(A14,Årlig!$A:$E,5,0)),IF(VLOOKUP(A14,Kvartal!$A:$E,5,0)=\"\",\"\",VLOOKUP(A14,Kvartal!$A:$E,5,0)))","v":""}]
["ccr_6","4.2",null,"Andre forbrukslån",null,null,"0060",{"$f":"IF(MONTH(Forside!$D$12)=12,IF(VLOOKUP(A15,Årlig!$A:$E,4,0)=\"\",\"\",VLOOKUP(A15,Årlig!$A:$E,4,0)),IF(VLOOKUP(A15,Kvartal!$A:$E,4,0)=\"\",\"\",VLOOKUP(A15,Kvartal!$A:$E,4,0)))","v":""},{"$f":"IF(MONTH(Forside!$D$12)=12,IF(VLOOKUP(A15,Årlig!$A:$E,5,0)=\"\",\"\",VLOOKUP(A15,Årlig!$A:$E,5,0)),IF(VLOOKUP(A15,Kvartal!$A:$E,5,0)=\"\",\"\",VLOOKUP(A15,Kvartal!$A:$E,5,0)))","v":""}]
["ccr_7",5,"Resultat av ordinær drift før skatt",null,null,null,"0070",{"$f":"IF(MONTH(Forside!$D$12)=12,IF(VLOOKUP(A16,Årlig!$A:$E,4,0)=\"\",\"\",VLOOKUP(A16,Årlig!$A:$E,4,0)),IF(VLOOKUP(A16,Kvartal!$A:$E,4,0)=\"\",\"\",VLOOKUP(A16,Kvartal!$A:$E,4,0)))","v":""},{"$f":"IF(MONTH(Forside!$D$12)=12,IF(VLOOKUP(A16,Årlig!$A:$E,5,0)=\"\",\"\",VLOOKUP(A16,Årlig!$A:$E,5,0)),IF(VLOOKUP(A16,Kvartal!$A:$E,5,0)=\"\",\"\",VLOOKUP(A16,Kvartal!$A:$E,5,0)))","v":""}]
["ccr_8","6.","Gjennomsnittlig forvaltningskapital",null,null,null,"0080",{"$f":"IF(MONTH(Forside!$D$12)=12,IF(VLOOKUP(A17,Årlig!$A:$E,4,0)=\"\",\"\",VLOOKUP(A17,Årlig!$A:$E,4,0)),IF(VLOOKUP(A17,Kvartal!$A:$E,4,0)=\"\",\"\",VLOOKUP(A17,Kvartal!$A:$E,4,0)))","v":""},{"$f":"IF(MONTH(Forside!$D$12)=12,IF(VLOOKUP(A17,Årlig!$A:$E,5,0)=\"\",\"\",VLOOKUP(A17,Årlig!$A:$E,5,0)),IF(VLOOKUP(A17,Kvartal!$A:$E,5,0)=\"\",\"\",VLOOKUP(A17,Kvartal!$A:$E,5,0)))","v":""}]
["ccr_9","7.","Brutto utlån kunder (Code 0150 + Code 0190) ",null,null,null,"0090",{"$f":"IF(MONTH(Forside!$D$12)=12,IF(VLOOKUP(A18,Årlig!$A:$E,4,0)=\"\",\"\",VLOOKUP(A18,Årlig!$A:$E,4,0)),IF(VLOOKUP(A18,Kvartal!$A:$E,4,0)=\"\",\"\",VLOOKUP(A18,Kvartal!$A:$E,4,0)))","v":""},{"$f":"IF(MONTH(Forside!$D$12)=12,IF(VLOOKUP(A18,Årlig!$A:$E,5,0)=\"\",\"\",VLOOKUP(A18,Årlig!$A:$E,5,0)),IF(VLOOKUP(A18,Kvartal!$A:$E,5,0)=\"\",\"\",VLOOKUP(A18,Kvartal!$A:$E,5,0)))","v":""}]
["ccr_27",null,"Brutto utlån kunder","Landfordelt","Norge",null,"0100",{"$f":"IF(MONTH(Forside!$D$12)=12,IF(VLOOKUP(A19,Årlig!$A:$E,4,0)=\"\",\"\",VLOOKUP(A19,Årlig!$A:$E,4,0)),IF(VLOOKUP(A19,Kvartal!$A:$E,4,0)=\"\",\"\",VLOOKUP(A19,Kvartal!$A:$E,4,0)))","v":""},{"$f":"IF(MONTH(Forside!$D$12)=12,IF(VLOOKUP(A19,Årlig!$A:$E,5,0)=\"\",\"\",VLOOKUP(A19,Årlig!$A:$E,5,0)),IF(VLOOKUP(A19,Kvartal!$A:$E,5,0)=\"\",\"\",VLOOKUP(A19,Kvartal!$A:$E,5,0)))","v":""}]
["ccr_28",null,null,null,"Sverige",null,"0110",{"$f":"IF(MONTH(Forside!$D$12)=12,IF(VLOOKUP(A20,Årlig!$A:$E,4,0)=\"\",\"\",VLOOKUP(A20,Årlig!$A:$E,4,0)),IF(VLOOKUP(A20,Kvartal!$A:$E,4,0)=\"\",\"\",VLOOKUP(A20,Kvartal!$A:$E,4,0)))","v":""},{"$f":"IF(MONTH(Forside!$D$12)=12,IF(VLOOKUP(A20,Årlig!$A:$E,5,0)=\"\",\"\",VLOOKUP(A20,Årlig!$A:$E,5,0)),IF(VLOOKUP(A20,Kvartal!$A:$E,5,0)=\"\",\"\",VLOOKUP(A20,Kvartal!$A:$E,5,0)))","v":""}]
{"$rows_left_out":27}
{"sheet":"nfl_02","index":5,"n_rows":50,"n_cols":10,"rows_kept":50,"cut":false,"hidden":true,"merged":[[5,6,6,7],[5,8,5,9],[6,8,6,9]]}
[null,null,null,null,null,null,"nfl_02. Fordeling av post 15 (Brutto utlån solgt) pr. foretak"]
[]
[]
[]
[]
[null,null,null,null,null,null,"Foretak som portefølje er solgt til",null,"Brutto utlån solgt"]
[null,null,null,null,null,null,null,null,"Beløp (mill.kr) hittil i år"]
[null,null,null,null,null,null,"Organisasjonsnummer*","Foretaksnavn (fullstendig)",{"$f":"nfl_01!H8","v":"pr. 31.03.2025"},{"$f":"nfl_01!I8","v":"pr. 31.03.2024"}]
[null,null,null,null,null,null,"0010","0020","0030","0040"]
[null,null,null,null,null,null,{"$f":"+IF('Fordeling av post 15'!B8=\"\",\"\",'Fordeling av post 15'!B8)","v":""},{"$f":"+IF('Fordeling av post 15'!C8=\"\",\"\",'Fordeling av post 15'!C8)","v":""},{"$f":"+IF('Fordeling av post 15'!D8=\"\",\"\",'Fordeling av post 15'!D8)","v":""},{"$f":"+IF('Fordeling av post 15'!E8=\"\",\"\",'Fordeling av post 15'!E8)","v":""}]
[null,null,null,null,null,null,{"$f":"+IF('Fordeling av post 15'!B9=\"\",\"\",'Fordeling av post 15'!B9)","v":""},{"$f":"+IF('Fordeling av post 15'!C9=\"\",\"\",'Fordeling av post 15'!C9)","v":""},{"$f":"+IF('Fordeling av post 15'!D9=\"\",\"\",'Fordeling av post 15'!D9)","v":""},{"$f":"+IF('Fordeling av post 15'!E9=\"\",\"\",'Fordeling av post 15'!E9)","v":""}]
[null,null,null,null,null,null,{"$f":"+IF('Fordeling av post 15'!B10=\"\",\"\",'Fordeling av post 15'!B10)","v":""},{"$f":"+IF('Fordeling av post 15'!C10=\"\",\"\",'Fordeling av post 15'!C10)","v":""},{"$f":"+IF('Fordeling av post 15'!D10=\"\",\"\",'Fordeling av post 15'!D10)","v":""},{"$f":"+IF('Fordeling av post 15'!E10=\"\",\"\",'Fordeling av post 15'!E10)","v":""}]
[null,null,null,null,null,null,{"$f":"+IF('Fordeling av post 15'!B11=\"\",\"\",'Fordeling av post 15'!B11)","v":""},{"$f":"+IF('Fordeling av post 15'!C11=\"\",\"\",'Fordeling av post 15'!C11)","v":""},{"$f":"+IF('Fordeling av post 15'!D11=\"\",\"\",'Fordeling av post 15'!D11)","v":""},{"$f":"+IF('Fordeling av post 15'!E11=\"\",\"\",'Fordeling av post 15'!E11)","v":""}]
[null,null,null,null,null,null,{"$f":"+IF('Fordeling av post 15'!B12=\"\",\"\",'Fordeling av post 15'!B12)","v":""},{"$f":"+IF('Fordeling av post 15'!C12=\"\",\"\",'Fordeling av post 15'!C12)","v":""},{"$f":"+IF('Fordeling av post 15'!D12=\"\",\"\",'Fordeling av post 15'!D12)","v":""},{"$f":"+IF('Fordeling av post 15'!E12=\"\",\"\",'Fordeling av post 15'!E12)","v":""}]
[null,null,null,null,null,null,{"$f":"+IF('Fordeling av post 15'!B13=\"\",\"\",'Fordeling av post 15'!B13)","v":""},{"$f":"+IF('Fordeling av post 15'!C13=\"\",\"\",'Fordeling av post 15'!C13)","v":""},{"$f":"+IF('Fordeling av post 15'!D13=\"\",\"\",'Fordeling av post 15'!D13)","v":""},{"$f":"+IF('Fordeling av post 15'!E13=\"\",\"\",'Fordeling av post 15'!E13)","v":""}]
[null,null,null,null,null,null,{"$f":"+IF('Fordeling av post 15'!B14=\"\",\"\",'Fordeling av post 15'!B14)","v":""},{"$f":"+IF('Fordeling av post 15'!C14=\"\",\"\",'Fordeling av post 15'!C14)","v":""},{"$f":"+IF('Fordeling av post 15'!D14=\"\",\"\",'Fordeling av post 15'!D14)","v":""},{"$f":"+IF('Fordeling av post 15'!E14=\"\",\"\",'Fordeling av post 15'!E14)","v":""}]
[null,null,null,null,null,null,{"$f":"+IF('Fordeling av post 15'!B15=\"\",\"\",'Fordeling av post 15'!B15)","v":""},{"$f":"+IF('Fordeling av post 15'!C15=\"\",\"\",'Fordeling av post 15'!C15)","v":""},{"$f":"+IF('Fordeling av post 15'!D15=\"\",\"\",'Fordeling av post 15'!D15)","v":""},{"$f":"+IF('Fordeling av post 15'!E15=\"\",\"\",'Fordeling av post 15'!E15)","v":""}]
[null,null,null,null,null,null,{"$f":"+IF('Fordeling av post 15'!B16=\"\",\"\",'Fordeling av post 15'!B16)","v":""},{"$f":"+IF('Fordeling av post 15'!C16=\"\",\"\",'Fordeling av post 15'!C16)","v":""},{"$f":"+IF('Fordeling av post 15'!D16=\"\",\"\",'Fordeling av post 15'!D16)","v":""},{"$f":"+IF('Fordeling av post 15'!E16=\"\",\"\",'Fordeling av post 15'!E16)","v":""}]
[null,null,null,null,null,null,{"$f":"+IF('Fordeling av post 15'!B17=\"\",\"\",'Fordeling av post 15'!B17)","v":""},{"$f":"+IF('Fordeling av post 15'!C17=\"\",\"\",'Fordeling av post 15'!C17)","v":""},{"$f":"+IF('Fordeling av post 15'!D17=\"\",\"\",'Fordeling av post 15'!D17)","v":""},{"$f":"+IF('Fordeling av post 15'!E17=\"\",\"\",'Fordeling av post 15'!E17)","v":""}]
[null,null,null,null,null,null,{"$f":"+IF('Fordeling av post 15'!B18=\"\",\"\",'Fordeling av post 15'!B18)","v":""},{"$f":"+IF('Fordeling av post 15'!C18=\"\",\"\",'Fordeling av post 15'!C18)","v":""},{"$f":"+IF('Fordeling av post 15'!D18=\"\",\"\",'Fordeling av post 15'!D18)","v":""},{"$f":"+IF('Fordeling av post 15'!E18=\"\",\"\",'Fordeling av post 15'!E18)","v":""}]
{"$rows_left_out":31}
{"sheet":"nfl_03","index":6,"n_rows":33,"n_cols":9,"rows_kept":33,"cut":false,"hidden":true,"merged":[[21,3,32,3],[21,4,21,5],[22,4,26,4],[27,4,27,5],[28,4,32,4],[6,7,6,8],[9,3,20,3],[9,4,9,5],[10,4,14,4],[15,4,15,5],[16,4,20,4]]}
[null,null,null,"nfl_03. Brutto utlån og misligholdte engasjementer - Norge, fordelt på låntakers alder"]
[]
[]
[]
[]
[]
[null,null,null,{"$f":"IF([1]Forside!G12=\"4. kvartal\",\"\",\"SKAL IKKE RAPPORTERES FOR DENNE PERIODEN\")","v":"SKAL IKKE RAPPORTERES FOR DENNE PERIODEN"},null,null,null,"Beløp (mill.kr)"]
[null,null,null,null,null,null,null,{"$f":"nfl_01!H8","v":"pr. 31.03.2025"},{"$f":"nfl_01!I8","v":"pr. 31.03.2024"}]
[null,null,null,null,null,null,"Code","0010","0020"]
[null,"ccr_12","7.3","Brutto utlån kunder - Norge","Kredittkort",null,"0010",{"$f":"IF(VLOOKUP(B10,Årlig!$A:$E,4,0)=\"\",\"\",VLOOKUP(B10,Årlig!$A:$E,4,0))","v":""},{"$f":"IF(VLOOKUP(B10,Årlig!$A:$E,5,0)=\"\",\"\",VLOOKUP(B10,Årlig!$A:$E,5,0))","v":""}]
[null,"ccr_44","18.1",null,"Kredittkort","18-29 år","0020",{"$f":"IF(VLOOKUP(B11,Årlig!$A:$E,4,0)=\"\",\"\",VLOOKUP(B11,Årlig!$A:$E,4,0))","v":""},{"$f":"IF(VLOOKUP(B11,Årlig!$A:$E,5,0)=\"\",\"\",VLOOKUP(B11,Årlig!$A:$E,5,0))","v":""}]
[null,"ccr_45","18.2",null,null,"30-39 år","0030",{"$f":"IF(VLOOKUP(B12,Årlig!$A:$E,4,0)=\"\",\"\",VLOOKUP(B12,Årlig!$A:$E,4,0))","v":""},{"$f":"IF(VLOOKUP(B12,Årlig!$A:$E,5,0)=\"\",\"\",VLOOKUP(B12,Årlig!$A:$E,5,0))","v":""}]
[null,"ccr_46","18.3",null,null,"40-49 år","0040",{"$f":"IF(VLOOKUP(B13,Årlig!$A:$E,4,0)=\"\",\"\",VLOOKUP(B13,Årlig!$A:$E,4,0))","v":""},{"$f":"IF(VLOOKUP(B13,Årlig!$A:$E,5,0)=\"\",\"\",VLOOKUP(B13,Årlig!$A:$E,5,0))","v":""}]
[null,"ccr_47","18.4",null,null,"50-59 år","0050",{"$f":"IF(VLOOKUP(B14,Årlig!$A:$E,4,0)=\"\",\"\",VLOOKUP(B14,Årlig!$A:$E,4,0))","v":""},{"$f":"IF(VLOOKUP(B14,Årlig!$A:$E,5,0)=\"\",\"\",VLOOKUP(B14,Årlig!$A:$E,5,0))","v":""}]
[null,"ccr_48","18.5",null,null,"60 år +","0060",{"$f":"IF(VLOOKUP(B15,Årlig!$A:$E,4,0)=\"\",\"\",VLOOKUP(B15,Årlig!$A:$E,4,0))","v":""},{"$f":"IF(VLOOKUP(B15,Årlig!$A:$E,5,0)=\"\",\"\",VLOOKUP(B15,Årlig!$A:$E,5,0))","v":""}]
[null,"ccr_15","7.7",null,"Andre forbrukslån",null,"0070",{"$f":"IF(VLOOKUP(B16,Årlig!$A:$E,4,0)=\"\",\"\",VLOOKUP(B16,Årlig!$A:$E,4,0))","v":""},{"$f":"IF(VLOOKUP(B16,Årlig!$A:$E,5,0)=\"\",\"\",VLOOKUP(B16,Årlig!$A:$E,5,0))","v":""}]
[null,"ccr_50","18.1",null,"Andre forbrukslån","18-29 år","0080",{"$f":"IF(VLOOKUP(B17,Årlig!$A:$E,4,0)=\"\",\"\",VLOOKUP(B17,Årlig!$A:$E,4,0))","v":""},{"$f":"IF(VLOOKUP(B17,Årlig!$A:$E,5,0)=\"\",\"\",VLOOKUP(B17,Årlig!$A:$E,5,0))","v":""}]
[null,"ccr_51","18.2",null,null,"30-39 år","0090",{"$f":"IF(VLOOKUP(B18,Årlig!$A:$E,4,0)=\"\",\"\",VLOOKUP(B18,Årlig!$A:$E,4,0))","v":""},{"$f":"IF(VLOOKUP(B18,Årlig!$A:$E,5,0)=\"\",\"\",VLOOKUP(B18,Årlig!$A:$E,5,0))","v":""}]
[null,"ccr_52","18.3",null,null,"40-49 år","0100",{"$f":"IF(VLOOKUP(B19,Årlig!$A:$E,4,0)=\"\",\"\",VLOOKUP(B19,Årlig!$A:$E,4,0))","v":""},{"$f":"IF(VLOOKUP(B19,Årlig!$A:$E,5,0)=\"\",\"\",VLOOKUP(B19,Årlig!$A:$E,5,0))","v":""}]
[null,"ccr_53","18.4",null,null,"50-59 år","0110",{"$f":"IF(VLOOKUP(B20,Årlig!$A:$E,4,0)=\"\",\"\",VLOOKUP(B20,Årlig!$A:$E,4,0))","v":""},{"$f":"IF(VLOOKUP(B20,Årlig!$A:$E,5,0)=\"\",\"\",VLOOKUP(B20,Årlig!$A:$E,5,0))","v":""}]
{"$rows_left_out":14}
{"sheet":"nfl_04","index":7,"n_rows":15,"n_cols":9,"rows_kept":15,"cut":false,"hidden":true,"merged":[[6,7,6,8],[9,4,9,5],[10,4,11,4],[12,4,12,5],[13,4,14,4]]}
[null,null,null,null,"nfl_04. Lånesøknader (årlig)"]
[]
[]
[]
[]
[]
[null,null,null,null,{"$f":"IF([1]Forside!G12=\"4. kvartal\",\"\",\"SKAL IKKE RAPPORTERES FOR DENNE PERIODEN\")","v":"SKAL IKKE RAPPORTERES FOR DENNE PERIODEN"},null,null,"Antall"]
[null,null,null,null,null,null,null,{"$f":"nfl_01!H8","v":"pr. 31.03.2025"},{"$f":"nfl_01!I8","v":"pr. 31.03.2024"}]
[null,null,null,null,null,null,"Code","0010","0020"]
[null,null,"ccr_38","16.","Lånesøknader til behandling",null,"0010",{"$f":"IF(VLOOKUP(C10,Årlig!$A:$E,4,0)=\"\",\"\",VLOOKUP(C10,Årlig!$A:$E,4,0))","v":""},{"$f":"IF(VLOOKUP(C10,Årlig!$A:$E,5,0)=\"\",\"\",VLOOKUP(C10,Årlig!$A:$E,5,0))","v":""}]
[null,null,"ccr_39","16.1","Lånesøknader til behandling","kredittkort","0020",{"$f":"IF(VLOOKUP(C11,Årlig!$A:$E,4,0)=\"\",\"\",VLOOKUP(C11,Årlig!$A:$E,4,0))","v":""},{"$f":"IF(VLOOKUP(C11,Årlig!$A:$E,5,0)=\"\",\"\",VLOOKUP(C11,Årlig!$A:$E,5,0))","v":""}]
[null,null,"ccr_40","16.2",null,"andre forbrukslån","0030",{"$f":"IF(VLOOKUP(C12,Årlig!$A:$E,4,0)=\"\",\"\",VLOOKUP(C12,Årlig!$A:$E,4,0))","v":""},{"$f":"IF(VLOOKUP(C12,Årlig!$A:$E,5,0)=\"\",\"\",VLOOKUP(C12,Årlig!$A:$E,5,0))","v":""}]
[null,null,"ccr_41","17.","Avslåtte lånesøknader ",null,"0040",{"$f":"IF(VLOOKUP(C13,Årlig!$A:$E,4,0)=\"\",\"\",VLOOKUP(C13,Årlig!$A:$E,4,0))","v":""},{"$f":"IF(VLOOKUP(C13,Årlig!$A:$E,5,0)=\"\",\"\",VLOOKUP(C13,Årlig!$A:$E,5,0))","v":""}]
[null,null,"ccr_42","17.1","Avslåtte lånesøknader ","kredittkort","0050",{"$f":"IF(VLOOKUP(C14,Årlig!$A:$E,4,0)=\"\",\"\",VLOOKUP(C14,Årlig!$A:$E,4,0))","v":""},{"$f":"IF(VLOOKUP(C14,Årlig!$A:$E,5,0)=\"\",\"\",VLOOKUP(C14,Årlig!$A:$E,5,0))","v":""}]
[null,null,"ccr_43","17.2",null,"andre forbrukslån","0060",{"$f":"IF(VLOOKUP(C15,Årlig!$A:$E,4,0)=\"\",\"\",VLOOKUP(C15,Årlig!$A:$E,4,0))","v":""},{"$f":"IF(VLOOKUP(C15,Årlig!$A:$E,5,0)=\"\",\"\",VLOOKUP(C15,Årlig!$A:$E,5,0))","v":""}]

{"sheet":"global","index":8,"n_rows":8,"n_cols":3,"rows_kept":8,"cut":false,"hidden":true,"merged":[]}
["Name","Key","Value"]
["Excel versjonsnummer (mottaksløsning)","dwh_excel_version",{"$f":"+Forside!$A$2","v":293}]
["Workbook version","workbook_version",1]
["Workbook code","workbook_code","nfl"]
["KRT number","krt_number",{"$f":"+Forside!$C$1","v":"KRT-1133"}]
["Identifier","identifier",{"$f":"+Forside!$G$10","v":0}]
["Reporting period","reporting_period",{"$f":"+Forside!$D$12","v":"31.03.2025"}]
["Consolidation level","consolidaton_level","Ikke konsolidert"]